{"text_format":"1","workbook":"xlsx","n_sheets":2,"sheets":["159","muni"],"not_rendered":{"charts":0,"images":0,"macros":1,"external_links":0,"defined_names":1,"comments":1,"pivot_tables":0},"unopened":[],"bounds":{"document_bytes":16777216,"sheet_cells":100000,"rows_first":2000,"rows_last":500,"rows_between":2000,"halvings":0,"cell_chars":16384,"cell_head_chars":4096},"cells_cut":0,"cells_raw":0,"read":"whole","date_system":"1900"}

{"sheet":"159","index":0,"n_rows":45,"n_cols":19,"rows_kept":45,"cut":false,"hidden":false,"merged":[[1,10,1,11],[13,11,13,15],[2,14,2,15],[14,12,14,13],[16,12,16,13],[7,13,7,16],[3,10,3,16],[4,10,4,16],[10,12,10,13],[12,12,12,13],[30,14,30,16],[18,12,18,13],[11,11,11,15],[34,10,34,14],[17,12,17,13],[22,10,22,16],[20,10,20,16],[39,10,39,13],[31,10,31,12],[25,14,25,16],[24,10,24,12],[26,10,26,12],[28,10,28,12],[27,10,27,12],[29,10,29,12],[30,10,30,12],[27,14,27,16],[29,14,29,16],[31,14,31,16],[25,10,25,12],[28,14,28,16],[26,14,26,16],[24,14,24,16]]}
[{"$f":"MID(CELL(\"filename\",A1),FIND(\"]\",CELL(\"filename\",A1))+1,256)","v":"159"},{"$f":"ROW()","v":1},{"$f":"INDEX(muni!B1:B588,L3,1)","v":"0001"},{"$f":"INDEX(muni!P1:P16,L9,1)","v":2022},159,"file","res",{"$f":"\"Attached is the 159. \nI also made sure to attach the resolution to this email. \nI, \"&O25&\" -Chief Financial Officer of \"&N8&\", Certify that all information included in this email is accurate.\"","v":"Attached is the 159. \nI also made sure to attach the resolution to this email. \nI,  -Chief Financial Officer of 0001 Select your municipality or county, Certify that all information included in this email is accurate."},{"$f":"M7","v":"00:00:00"},{"$f":"P7","v":0},null,null,"Resolution File Name:",{"$f":"L8&\"_87r_\"&TEXT(M7, \"mm-dd-yyyy\")&\"_\"&P7&\".pdf \"","v":"0001_87r_01-00-1900_.pdf "}]
[{"$f":"MID(CELL(\"filename\",A2),FIND(\"]\",CELL(\"filename\",A2))+1,256)","v":"159"},{"$f":"ROW()","v":2},{"$f":"INDEX(muni!B1:B588,L3,1)","v":"0001"},{"$f":"INDEX(muni!P1:P16,L9,1)","v":2022},159,"file","name",{"$f":"\"mailto:159_lgs@dca.nj.gov?subject=\"&Q1&\"&body= \"&O25&\" - CFO, Certifies that all information in this email is accurate.%0A%0AAttached \"&Q1&\" and \"&N1&\".\"","v":"mailto:159_lgs@dca.nj.gov?subject=&body=  - CFO, Certifies that all information in this email is accurate.%0A%0AAttached  and 0001_87r_01-00-1900_.pdf ."},{"$f":"M7","v":"00:00:00"},{"$f":"P7","v":0},{"$f":"HYPERLINK(H2,\"Email the 159 if not using Outlook\")","v":"Email the 159 if not using Outlook"},null,"159 File Name:",{"$f":"L8&\"_159_\"&TEXT(M7, \"mm-dd-yyyy\")&\"_\"&P7&\".xlsm \"","v":"0001_159_01-00-1900_.xlsm "}]
[{"$f":"MID(CELL(\"filename\",A3),FIND(\"]\",CELL(\"filename\",A3))+1,256)","v":"159"},{"$f":"ROW()","v":3},{"$f":"INDEX(muni!B1:B588,L3,1)","v":"0001"},{"$f":"INDEX(muni!P1:P16,L9,1)","v":2022},159,null,null,{"$f":"O25&\" - CFO, \n\nThe attached Chapter 159 Insertion of Special Item or Revenue and/or Chapter 85 Text & Title resolution , File \"&N1&\", has not been approved by the Director of the Division of Local Government Services.\nPlease resolve the following issues:\"","v":" - CFO, \n\nThe attached Chapter 159 Insertion of Special Item or Revenue and/or Chapter 85 Text & Title resolution , File 0001_87r_01-00-1900_.pdf , has not been approved by the Director of the Division of Local Government Services.\nPlease resolve the following issues:"},{"$f":"M7","v":"00:00:00"},{"$f":"P7","v":0},null,1,null,null,"Select your local Government unit by pressing the triangle",null,null,null," "]
["159",{"$f":"ROW()","v":4},{"$f":"INDEX(muni!B1:B588,L3,1)","v":"0001"},{"$f":"INDEX(muni!P1:P16,L9,1)","v":2022},159,null,null,{"$f":"O25&\" - CFO, \n\nThe attached Chapter 159 Insertion of Special Item or Revenue and/or Chapter 85 Text & Title resolution , File \"&N2&\", has been approved by the Director of the Division of Local Government Services.\"","v":" - CFO, \n\nThe attached Chapter 159 Insertion of Special Item or Revenue and/or Chapter 85 Text & Title resolution , File 0001_159_01-00-1900_.xlsm , has been approved by the Director of the Division of Local Government Services."},{"$f":"M7","v":"00:00:00"},{"$f":"P7","v":0},"Budget Amendment Certification Form, Appropriations Offset by Revenue"]
["159",{"$f":"ROW()","v":5},{"$f":"INDEX(muni!B1:B588,L3,1)","v":"0001"},{"$f":"INDEX(muni!P1:P16,L9,1)","v":2022},159,null,null,{"$f":"O25&\" - CFO, \nPlease be advised that you request for approval for and Insertion of an Special Item of Revenue (Chapter 159) Resolution or Change of Title and Text resolution was denied by the Director of Local Government Services for the following reason: \"","v":" - CFO, \nPlease be advised that you request for approval for and Insertion of an Special Item of Revenue (Chapter 159) Resolution or Change of Title and Text resolution was denied by the Director of Local Government Services for the following reason: "},{"$f":"M7","v":"00:00:00"},{"$f":"P7","v":0},"Counties/Municipalities (NJSA 40A:4-87) or Fire Districts (NJSA 40A:14-78.5)"]
[{"$f":"MID(CELL(\"filename\",A5),FIND(\"]\",CELL(\"filename\",A5))+1,256)","v":"159"},{"$f":"ROW()","v":6},{"$f":"INDEX(muni!B1:B588,L3,1)","v":"0001"},{"$f":"INDEX(muni!P1:P16,L9,1)","v":2022},159,null,null,{"$f":"\"\nIf you have any questions please contact Jorge F Carmona at jorge.carmona@dca.state.nj.us or (609) 913-4396\"","v":"\nIf you have any questions please contact Jorge F Carmona at jorge.carmona@dca.state.nj.us or (609) 913-4396"},{"$f":"M7","v":"00:00:00"},{"$f":"P7","v":0}]
["159",{"$f":"ROW()","v":7},{"$f":"INDEX(muni!B1:B588,L3,1)","v":"0001"},{"$f":"INDEX(muni!P1:P16,L9,1)","v":2022},159,"res","res",{"$f":"\"\nIf you have any questions please contact Jorge F Carmona at jorge.carmona@dca.state.nj.us or (609) 913-4396\"","v":"\nIf you have any questions please contact Jorge F Carmona at jorge.carmona@dca.state.nj.us or (609) 913-4396"},{"$f":"M7","v":"00:00:00"},{"$f":"P7","v":0},null," Resolution Date:",null,null,"Resolution #"]
[{"$f":"MID(CELL(\"filename\",A8),FIND(\"]\",CELL(\"filename\",A8))+1,256)","v":"159"},{"$f":"ROW()","v":8},{"$f":"INDEX(muni!B1:B588,L3,1)","v":"0001"},{"$f":"INDEX(muni!P1:P16,L9,1)","v":2022},159,"muni","code",{"$f":"\"\n__           Duplicate\n\n__           Doesn’t qualify as insertion of Special Item of Revenue\n\n__           Additional supporting documentation needed\n\"","v":"\n__           Duplicate\n\n__           Doesn’t qualify as insertion of Special Item of Revenue\n\n__           Additional supporting documentation needed\n"},{"$f":"M7","v":"00:00:00"},{"$f":"P7","v":0},"Muni Code",{"$f":"INDEX(muni!B1:B588,L3,1)","v":"0001"},"Organization Name",{"$f":"INDEX(muni!A1:A588,L3,1)","v":"0001 Select your municipality or county"}]
["159",{"$f":"ROW()","v":9},{"$f":"INDEX(muni!B1:B588,L3,1)","v":"0001"},{"$f":"INDEX(muni!P1:P16,L9,1)","v":2022},159,"year","code",{"$f":"H4&H6","v":" - CFO, \n\nThe attached Chapter 159 Insertion of Special Item or Revenue and/or Chapter 85 Text & Title resolution , File 0001_159_01-00-1900_.xlsm , has been approved by the Director of the Division of Local Government Services.\nIf you have any questions please contact Jorge F Carmona at jorge.carmona@dca.state.nj.us or (609) 913-4396"},{"$f":"M7","v":"00:00:00"},{"$f":"P7","v":0},"Fiscal Year",8,3]
["159",{"$f":"ROW()","v":10},{"$f":"INDEX(muni!B1:B588,L3,1)","v":"0001"},{"$f":"INDEX(muni!P1:P16,L9,1)","v":2022},159,"res","no",{"$f":"H4&H7","v":" - CFO, \n\nThe attached Chapter 159 Insertion of Special Item or Revenue and/or Chapter 85 Text & Title resolution , File 0001_159_01-00-1900_.xlsm , has been approved by the Director of the Division of Local Government Services.\nIf you have any questions please contact Jorge F Carmona at jorge.carmona@dca.state.nj.us or (609) 913-4396"},{"$f":"M7","v":"00:00:00"},{"$f":"P7","v":0}]
["159",{"$f":"ROW()","v":11},{"$f":"INDEX(muni!B1:B588,L3,1)","v":"0001"},{"$f":"INDEX(muni!P1:P16,L9,1)","v":2022},159,"rev",{"$f":"INDEX(muni!J1:J152,M11,1)","v":"100A"},{"$f":" H5&H8&H6","v":" - CFO, \nPlease be advised that you request for approval for and Insertion of an Special Item of Revenue (Chapter 159) Resolution or Change of Title and Text resolution was denied by the Director of Local Government Services for the following reason: \n__           Duplicate\n\n__           Doesn’t qualify as insertion of Special Item of Revenue\n\n__           Additional supporting documentation needed\n\nIf you have any questions please contact Jorge F Carmona at jorge.carmona@dca.state.nj.us or (609) 913-4396"},{"$f":"M7","v":"00:00:00"},{"$f":"P7","v":0},"Revenue","Title",1,null,"Amount"]
["159",{"$f":"ROW()","v":12},{"$f":"INDEX(muni!B1:B588,L3,1)","v":"0001"},{"$f":"INDEX(muni!P1:P16,L9,1)","v":2022},159,"rev","mdscr",{"$f":"H5&H8&H7","v":" - CFO, \nPlease be advised that you request for approval for and Insertion of an Special Item of Revenue (Chapter 159) Resolution or Change of Title and Text resolution was denied by the Director of Local Government Services for the following reason: \n__           Duplicate\n\n__           Doesn’t qualify as insertion of Special Item of Revenue\n\n__           Additional supporting documentation needed\n\nIf you have any questions please contact Jorge F Carmona at jorge.carmona@dca.state.nj.us or (609) 913-4396"},{"$f":"M7","v":"00:00:00"},{"$f":"P7","v":0},"Description"]
["159",{"$f":"ROW()","v":13},{"$f":"INDEX(muni!B1:B588,L3,1)","v":"0001"},{"$f":"INDEX(muni!P1:P16,L9,1)","v":2022},159,"app",{"$f":"INDEX(muni!J1:J152,M13,1)","v":"100A"},1,{"$f":"M7","v":"00:00:00"},{"$f":"P7","v":0},"Appropriation","Title",1,null,"Amount"]
["159",{"$f":"ROW()","v":14},{"$f":"INDEX(muni!B1:B588,L3,1)","v":"0001"},{"$f":"INDEX(muni!P1:P16,L9,1)","v":2022},159,"rev","mdsca",null,{"$f":"M7","v":"00:00:00"},{"$f":"P7","v":0},"Description"]
["159",{"$f":"ROW()","v":15},{"$f":"INDEX(muni!B1:B588,L3,1)","v":"0001"},{"$f":"INDEX(muni!P1:P16,L9,1)","v":2022},159,"locm",null,null,{"$f":"M7","v":"00:00:00"},{"$f":"P7","v":0},"Local Match",null,null,null,"Amount"]
[{"$f":"MID(CELL(\"filename\",A23),FIND(\"]\",CELL(\"filename\",A23))+1,256)","v":"159"},null,null,{"$f":"INDEX(muni!P1:P16,L9,1)","v":2022},null,null,null,null,{"$f":"M7","v":"00:00:00"},{"$f":"P7","v":0}]
["159",{"$f":"ROW()","v":17},{"$f":"INDEX(muni!B1:B588,L3,1)","v":"0001"},{"$f":"INDEX(muni!P1:P16,L9,1)","v":2022},159,"app85","amtr",null,{"$f":"M7","v":"00:00:00"},{"$f":"P7","v":0},"Municipalities and Counties only",null,"Chapter 85 - Title and Text"]
["159",{"$f":"ROW()","v":18},{"$f":"INDEX(muni!B1:B588,L3,1)","v":"0001"},{"$f":"INDEX(muni!P1:P16,L9,1)","v":2022},159,"app85","afrm",null,{"$f":"M7","v":"00:00:00"},{"$f":"P7","v":0},"Appropriation (From)","Title",null,null,"Amount"]
["159",{"$f":"ROW()","v":19},{"$f":"INDEX(muni!B1:B588,L3,1)","v":"0001"},{"$f":"INDEX(muni!P1:P16,L9,1)","v":2022},159,"app85","ato",null,{"$f":"M7","v":"00:00:00"},{"$f":"P7","v":0},"Appropriation (To)","Title",null,null,"Amount"]
[{"$f":"MID(CELL(\"filename\",A20),FIND(\"]\",CELL(\"filename\",A20))+1,256)","v":"159"},{"$f":"ROW()","v":20},{"$f":"INDEX(muni!B1:B588,L3,1)","v":"0001"},{"$f":"L9","v":8},159,null,null,null,{"$f":"M7","v":"00:00:00"},{"$f":"P7","v":0}]
[{"$f":"MID(CELL(\"filename\",A21),FIND(\"]\",CELL(\"filename\",A21))+1,256)","v":"159"},0,{"$f":"INDEX(muni!B1:B588,L3,1)","v":"0001"},{"$f":"INDEX(muni!P1:P16,L9,1)","v":2022},159,null,null,null,{"$f":"M7","v":"00:00:00"},{"$f":"P7","v":0},"By electronic transmittal of this form the County Clerk of the Board/Municipal Clerk/Fire District Executive Director certify that this resolution, reference above and included as an attachment with this form, is a true resolution and was properly adopted by the respective governing body"]
[{"$f":"MID(CELL(\"filename\",A21),FIND(\"]\",CELL(\"filename\",A21))+1,256)","v":"159"},0,null,null,null,null,null,null,{"$f":"M7","v":"00:00:00"},{"$f":"P7","v":0}]
["159",0,{"$f":"INDEX(muni!B1:B588,L3,1)","v":"0001"},{"$f":"INDEX(muni!P1:P16,L9,1)","v":2022},159,null,null,null,{"$f":"M7","v":"00:00:00"},{"$f":"P7","v":0},"By electronic transmittal of this form the County/Municipality CFO or the Fire District Accountant certifies that this revenue has been realized and/or is in receipt of written notification from the funding source cited in the resolution and included as an attachment with this form and that the revenue/appropriation identified above meets all statutory requirements and that the Annual Operating Budget has been amended to include this item of revenue/appropriation."]
[{"$f":"MID(CELL(\"filename\",A23),FIND(\"]\",CELL(\"filename\",A23))+1,256)","v":"159"},0,null,null,null,null,null,null,{"$f":"M7","v":"00:00:00"},{"$f":"P7","v":0}]
["159",{"$f":"ROW()","v":25},{"$f":"INDEX(muni!B1:B588,L3,1)","v":"0001"},{"$f":"INDEX(muni!P1:P16,L9,1)","v":2022},159,"cert","sig",null,{"$f":"M7","v":"00:00:00"},{"$f":"P7","v":0}]
["159",{"$f":"ROW()","v":26},{"$f":"INDEX(muni!B1:B588,L3,1)","v":"0001"},{"$f":"INDEX(muni!P1:P16,L9,1)","v":2022},159,null,null,null,{"$f":"M7","v":"00:00:00"},{"$f":"P7","v":0},"County Clerk of the Board, Municipal Clerk, or Fire District Director",null,null,null,"County/Municipal CFO or Fire District Accountant"]
["159",{"$f":"ROW()","v":27},{"$f":"INDEX(muni!B1:B588,L3,1)","v":"0001"},{"$f":"INDEX(muni!P1:P16,L9,1)","v":2022},159,"cert","job",null,{"$f":"M7","v":"00:00:00"},{"$f":"P7","v":0}]
["159",{"$f":"ROW()","v":28},{"$f":"INDEX(muni!B1:B588,L3,1)","v":"0001"},{"$f":"INDEX(muni!P1:P16,L9,1)","v":2022},159,null,null,null,{"$f":"M7","v":"00:00:00"},{"$f":"P7","v":0},"Title of Certifying Officer",null,null,null,"Title of Certifying Officer"]
["159",{"$f":"ROW()","v":29},{"$f":"INDEX(muni!B1:B588,L3,1)","v":"0001"},{"$f":"INDEX(muni!P1:P16,L9,1)","v":2022},159,"cert","email",null,{"$f":"M7","v":"00:00:00"},{"$f":"P7","v":0}]
["159",{"$f":"ROW()","v":30},{"$f":"INDEX(muni!B1:B588,L3,1)","v":"0001"},{"$f":"INDEX(muni!P1:P16,L9,1)","v":2022},159,null,null,null,{"$f":"M7","v":"00:00:00"},{"$f":"P7","v":0},"Email Address",null,null,null,"Email Address"]
["159",{"$f":"ROW()","v":31},{"$f":"INDEX(muni!B1:B588,L3,1)","v":"0001"},{"$f":"INDEX(muni!P1:P16,L9,1)","v":2022},159,"cert","tele",null,{"$f":"M7","v":"00:00:00"},{"$f":"P7","v":0}]
["159",{"$f":"ROW()","v":32},{"$f":"INDEX(muni!B1:B588,L3,1)","v":"0001"},{"$f":"INDEX(muni!P1:P16,L9,1)","v":2022},159,null,null,null,{"$f":"M7","v":"00:00:00"},{"$f":"P7","v":0},"Telephone Number",null,null,null,"Telephone Number"]
[{"$f":"MID(CELL(\"filename\",A32),FIND(\"]\",CELL(\"filename\",A32))+1,256)","v":"159"},{"$f":"ROW()","v":33},{"$f":"INDEX(muni!B1:B588,L3,1)","v":"0001"},{"$f":"INDEX(muni!P1:P16,L9,1)","v":2022},159,null,null,null,{"$f":"M7","v":"00:00:00"},{"$f":"P7","v":0}]
[{"$f":"MID(CELL(\"filename\",A32),FIND(\"]\",CELL(\"filename\",A32))+1,256)","v":"159"},{"$f":"ROW()","v":34},{"$f":"INDEX(muni!B1:B588,L3,1)","v":"0001"},{"$f":"INDEX(muni!P1:P16,L9,1)","v":2022},159,null,null,null,{"$f":"M7","v":"00:00:00"},{"$f":"P7","v":0}]
[{"$f":"MID(CELL(\"filename\",A32),FIND(\"]\",CELL(\"filename\",A32))+1,256)","v":"159"},{"$f":"ROW()","v":35},{"$f":"INDEX(muni!B1:B588,L3,1)","v":"0001"},{"$f":"INDEX(muni!P1:P16,L9,1)","v":2022},159,null,null,null,{"$f":"M7","v":"00:00:00"},{"$f":"P7","v":0},"Approval is hereby given to the cited resolution adopted by the governing body pursuant ",null,null,null,null," "]
[{"$f":"MID(CELL(\"filename\",A32),FIND(\"]\",CELL(\"filename\",A32))+1,256)","v":"159"},{"$f":"ROW()","v":36},{"$f":"INDEX(muni!B1:B588,L3,1)","v":"0001"},{"$f":"INDEX(muni!P1:P16,L9,1)","v":2022},159,null,null,null,{"$f":"M7","v":"00:00:00"},{"$f":"P7","v":0},"to N.J.S.A.40A: 4-87"]
[{"$f":"MID(CELL(\"filename\",A32),FIND(\"]\",CELL(\"filename\",A32))+1,256)","v":"159"},{"$f":"ROW()","v":37},{"$f":"INDEX(muni!B1:B588,L3,1)","v":"0001"},{"$f":"INDEX(muni!P1:P16,L9,1)","v":2022},159,null,null,null,{"$f":"M7","v":"00:00:00"},{"$f":"P7","v":0}]
[{"$f":"MID(CELL(\"filename\",A32),FIND(\"]\",CELL(\"filename\",A32))+1,256)","v":"159"},{"$f":"ROW()","v":38},{"$f":"INDEX(muni!B1:B588,L3,1)","v":"0001"},{"$f":"INDEX(muni!P1:P16,L9,1)","v":2022},159,"appr",{"$f":"INDEX(muni!N1:N5,P38,1)","v":"New"},null,{"$f":"M7","v":"00:00:00"},{"$f":"P7","v":0},"For Director, Division of Local Government Services by:",null,null,null,null,5]
[{"$f":"MID(CELL(\"filename\",A32),FIND(\"]\",CELL(\"filename\",A32))+1,256)","v":"159"},{"$f":"ROW()","v":39},{"$f":"INDEX(muni!B1:B588,L3,1)","v":"0001"},{"$f":"INDEX(muni!P1:P16,L9,1)","v":2022},159,null,null,null,{"$f":"M7","v":"00:00:00"},{"$f":"P7","v":0}]
[{"$f":"MID(CELL(\"filename\",A40),FIND(\"]\",CELL(\"filename\",A40))+1,256)","v":"159"},{"$f":"ROW()","v":40},{"$f":"INDEX(muni!B1:B588,L3,1)","v":"0001"},{"$f":"INDEX(muni!P1:P16,L9,1)","v":2022},159,"cert","appr",null,{"$f":"M7","v":"00:00:00"},{"$f":"P7","v":0},null,null,null,null," Approved Date:"]
{"$rows_left_out":6}
{"sheet":"muni","index":1,"n_rows":588,"n_cols":16,"rows_kept":588,"cut":false,"hidden":true,"merged":[]}
["0001 Select your municipality or county","0001",null,null,null,null,null,null,null,"100A","0001 Select  one","A","0001 Select your appropriation","Approved",1,2015]
["0100 Atlantic County - County of Atlantic","0100","Atlantic","County","Atlantic",55095839134,50154580592,50072316462,51774245396,"110APG","Area Plan Grant",null,null,"Cancelled",2,2016]
["0101 Absecon City - County of Atlantic","0101","Absecon","City","Atlantic",980749549,950824348,939953100,957175665.66666663,"120AFG","Assistance to Firefighters Grant Program",null,null,"Denied",3,2017]
["0102 Atlantic City City - County of Atlantic","0102","Atlantic City","City","Atlantic",19880647220,16154543008,17756290971,17930493733,"130ANJE","Association of New Jersey Environmental Commissions (ANJEC)",null,null,"Duplicate",4,2018]
["0103 Brigantine City - County of Atlantic","0103","Brigantine","City","Atlantic",4379818927,4230487885,3974124968,4194810593.3333335,"140BHP","Balanced Housing Program",null,null,"New",5,2019]
["0104 Buena Borough - County of Atlantic","0104","Buena","Borough","Atlantic",305894763,294696067,295763058,298784629.33333331,"150BAF","Body Armor Fund",null,null,null,6,2020]
["0105 Buena Vista Township - County of Atlantic","0105","Buena Vista","Township","Atlantic",658467965,635533070,612648886,635549973.66666663,"160BPVF","Bulletproof Vest Partnership Grant",null,null,null,7,2021]
["0106 Corbin City City - County of Atlantic","0106","Corbin City","City","Atlantic",55364675,45814763,63610528,54929988.666666664,"170BHI","Bureau of Housing Inspection",null,null,null,8,2022]
["0107 Egg Harbor City - County of Atlantic","0107","Egg Harbor","City","Atlantic",306447379,296742041,284215374,295801598,"180BCC","Cancer Education & Early Detection Program",null,null,null,9,2023]
["0108 Egg Harbor Township - County of Atlantic","0108","Egg Harbor","Township","Atlantic",5016891304,4746028429,4442228961,4735049564.666667,"190CRDA","Casino Reinvestment Development Authority",null,null,null,10,2024]
["0109 Estell Manor City - County of Atlantic","0109","Estell Manor","City","Atlantic",212851060,190425828,184657466,195978118,"200OPP","Click It or Ticket",null,null,null,11,2025]
["0110 Folsom Borough - County of Atlantic","0110","Folsom","Borough","Atlantic",205914935,188082445,189344654,194447344.66666666,"210IFPP","Co Prosecutor Insurance Fraud Reimbursement Program",null,null,null,12,2026]
["0111 Galloway Township - County of Atlantic","0111","Galloway","Township","Atlantic",3783277126,3604637059,3397832383,3595248856,"220CDBG","Community Development Block Grant",null,null,null,13,2027]
["0112 Hamilton Township - County of Atlantic","0112","Hamilton","Township","Atlantic",2649650403,2589581340,2432735441,2557322394.6666665,"230CFMP","Community Forestry Management Plan",null,null,null,14,2028]
["0113 Hammonton Town - County of Atlantic","0113","Hammonton","Town","Atlantic",1469260961,1522788887,1411600333,1467883393.6666667,"240CAT","Comprehensive Alcoholism & Drug Abuse Grant",null,null,null,15,2029]
["0114 Linwood City - County of Atlantic","0114","Linwood","City","Atlantic",1257915632,1198611612,1139027746,1198518330,"250CCCP","Comprehensive Cancer Control Plan",null,null,null,16,2030]
["0115 Longport Borough - County of Atlantic","0115","Longport","Borough","Atlantic",2254852840,2191149074,2041746416,2162582776.6666665,"260COPS","COPS Grants",null,null,null,17,2031]
["0116 Margate City - County of Atlantic","0116","Margate","City","Atlantic",4074750000,4015015685,3914453684,4001406456.3333335,"270CIS","Cops in Shops"]
["0117 Mullica Township - County of Atlantic","0117","Mullica","Township","Atlantic",635170897,588667608,570689176,598175893.66666663,"280CEHA","County Enviromental Health Act"]
["0118 Northfield City - County of Atlantic","0118","Northfield","City","Atlantic",1103541516,1050174524,998474154,1050730064.6666666,"290CNT","County of"]
["0119 Pleasantville City - County of Atlantic","0119","Pleasantville","City","Atlantic",1243538888,1187271106,1155207751,1195339248.3333333,"300SC","DCA - Small Cities Block Grant"]
["0120 Port Republic City - County of Atlantic","0120","Port Republic","City","Atlantic",150066498,143267037,139963512,144432349,"310NPP","DCA Neighborhood Preservation Program"]
["0121 Somers Point City - County of Atlantic","0121","Somers Point","City","Atlantic",1492153419,1410655785,1301392736,1401400646.6666667,"320HR","DCA -Recreation for Individuals With Disabilities"]
["0122 Ventnor City City - County of Atlantic","0122","Ventnor City","City","Atlantic",2799403461,2739910415,2657262963,2732192279.6666665,"330CSBG","DCA-Community Service Block Grant Program"]
["0123 Weymouth Township - County of Atlantic","0123","Weymouth","Township","Atlantic",179209716,179672576,169092201,175991497.66666666,"340SFPG","DCA-Smart Future Planning Grant"]
["0200 Bergen County - County of Bergen","0200","Bergen","County","Bergen",181733543797,175246376690,169704071487,175561330658,"350VWA","DCJ - Victims Witness Advocacy"]
["0201 Allendale Borough - County of Bergen","0201","Allendale","Borough","Bergen",1815809338,1738341030,1718398979,1757516449,"360DVRP","Delaware Valley Regional Planning Commission"]
["0202 Alpine Borough - County of Bergen","0202","Alpine","Borough","Bergen",2293389310,2431489964,2281521020,2335466764.6666665,"365DDSC","Distracted Driving Statewide Crackdown Grant."]
["0203 Bergenfield Borough - County of Bergen","0203","Bergenfield","Borough","Bergen",3010601783,2889034345,2752853164,2884163097.3333335,"370DON","Donations"]
["0204 Bogota Borough - County of Bergen","0204","Bogota","Borough","Bergen",903745746,849050076,803981809,852259210.33333337,"380DSGP","Drive Sober Or Get Pulled Over"]
["0205 Carlstadt Borough - County of Bergen","0205","Carlstadt","Borough","Bergen",2718624887,2312677012,2153807569,2395036489.3333335,"390DDEF","Drunk Driving Enforcement Fund"]
["0206 Cliffside Park Borough - County of Bergen","0206","Cliffside Park","Borough","Bergen",3497051576,3247584166,3056768027,3267134589.6666665,"400EIP","Early Intervention Program - Special Child Health Case Management"]
["0207 Closter Borough - County of Bergen","0207","Closter","Borough","Bergen",2219983425,2147720819,2093184451,2153629565,"410JAG","Edward Byrne Memorial Justice Assistance Grant (JAG)"]
["0208 Cresskill Borough - County of Bergen","0208","Cresskill","Borough","Bergen",2500482005,2307486462,2188980910,2332316459,"420ESP","Environmental Services Program"]
["0209 Demarest Borough - County of Bergen","0209","Demarest","Borough","Bergen",1446556295,1394421119,1347096908,1396024774,"430FEMA","FEMA - Federal Emergency Management Agency"]
["0210 Dumont Borough - County of Bergen","0210","Dumont","Borough","Bergen",2253730420,2124397126,2033581554,2137236366.6666667,"440GAP","Green Acres Program"]
["0211 Elmwood Park Borough - County of Bergen","0211","Elmwood Park","Borough","Bergen",2484403344,2365703750,2284163687,2378090260.3333335,"450HDSR","Hazaradous Discharges Site Remedetion Fund"]
["0212 East Rutherford Borough - County of Bergen","0212","East Rutherford","Borough","Bergen",1913723180,1977693084,1982798655,1958071639.6666667,"460HCG","Historical Commission Grant"]
["0213 Edgewater Borough - County of Bergen","0213","Edgewater","Borough","Bergen",2820483777,2833941706,2978119885,2877515122.6666665,"470HIV","HIV Emergency Relief Grant"]
["0214 Emerson Borough - County of Bergen","0214","Emerson","Borough","Bergen",1372215204,1358229922,1316332163,1348925763,"480JARC","Job Access & Reverse Commute (JARC)"]
{"$rows_left_out":548}