{"text_format":"1","workbook":"xlsx","n_sheets":17,"sheets":["Instructions","AR Contact Info","2a - Received - Detailed","2A - Received - Collection Site","2B - Received - Events","2C - Received - Miscellaneous","2D - Weight Received Summary","3A - Recycled","3b - Reused - Refurb.","3B - Disposed","4e - Percentages","3C - Stored","4A - CED Weight Sold","4B - CED Weight Purchased","Summary","Drop-Downs (do not change)","Sheet2"],"not_rendered":{"charts":0,"images":2,"macros":1,"external_links":0,"defined_names":91,"comments":0,"pivot_tables":0},"unopened":[],"bounds":{"document_bytes":16777216,"sheet_cells":100000,"rows_first":2000,"rows_last":500,"rows_between":2000,"halvings":0,"cell_chars":16384,"cell_head_chars":4096},"cells_cut":0,"cells_raw":0,"read":"whole","date_system":"1900"}

{"sheet":"Instructions","index":0,"n_rows":0,"n_cols":0,"rows_kept":0,"cut":false,"hidden":true,"merged":[]}

{"sheet":"AR Contact Info","index":1,"n_rows":20,"n_cols":9,"rows_kept":20,"cut":false,"hidden":false,"merged":[[13,0,20,0]]}
["Last Updated: 03/02/2022"]
["PART 1 – Authorized Recycler (AR) Contact Information",null,"Comments"]
["Submission Date:"]
["6-Month Reporting Period:\n(Check one)",1]
["Reporting Year:\n(Enter as YYYY, ex '2019')"]
["AR Name:"]
["PI Number:"]
["Contact Person's Name/Title:"]
["Contact Email Address:"]
["Contact Phone Number:"]
["Address:"]
["Mailing Address:\n(if different than the above)"]
[null,"Name and Address","Weight in Pounds"]
["Name, address and weight attributed to any intermediate handler not directly picked up by A.R. (facilities, transporters and subcontractors)"]
[]
[]
[]
[]
[]
[null,null,null,null,null,null,null,null,"."]

{"sheet":"2a - Received - Detailed","index":2,"n_rows":12,"n_cols":8,"rows_kept":12,"cut":false,"hidden":true,"merged":[[7,6,10,6],[7,7,10,7],[7,2,10,2],[7,0,10,0],[7,4,10,4],[7,1,10,1],[7,3,10,3],[7,5,10,5]]}
["CER Name:",{"$f":"+IF(+'AR Contact Info'!$B$6=\"\",\"[enter name on 'CER Contact Info' tab]\",'AR Contact Info'!$B$6)","v":"[enter name on 'CER Contact Info' tab]"}]
[]
["PART 2: DEVICES RECEIVED - INFORMATION ON TYPES & QUANTITIES OF CEDs AND non-CEDs MATERIAL COLLECTED BY THE REPORTING CER"]
[]
["Part 2a - Detailed Information (per 22a-638-1(c)(7)(B) & (C))"]
[]
[]
["Year - Month\n(yyyy - mm)","Town of Origin of CEDs Received\n●  CT City or Town of Origin; or\n●  If electronics are coming from a  CT regional or multi-town collection site, report the origin as the name & address of that site. ","Type of Collection\n●  permanent municipal facility\n●  permanent regional facility\n● permanent non-muni facility\n●  one-day municipal event             one-day regional event                     one day non-municipal event"," Manufacturer\n(if known - \nnot required for televisions)","Brand\n(if known - \nnot required for televisions)","Type\n● Computer\n● Monitor\n● Printer\n● Televisions\n(choose one)","# Units \nReceived","Pounds \nReceived"]
[]
[]
[]
["Totals"]

{"sheet":"2A - Received - Collection Site","index":3,"n_rows":1000,"n_cols":13,"rows_kept":1000,"cut":false,"hidden":false,"merged":[[3,9,3,11],[3,0,3,8]]}
["AR Name:",null,{"$f":"+IF(+'AR Contact Info'!$B$6=\"\",\"[enter name on 'AR Contact Info' tab]\",'AR Contact Info'!$B$6)","v":"[enter name on 'AR Contact Info' tab]"}]
[]
["PART 2A: ORIGIN, MATERIAL TYPE & QUANTITIES OF EACH TYPE OF INCOMING CED COLLECTED/RECEIVED BY AUTHORIZED RECYCLER FROM COLLECTION SITE LOCATIONS"]
["Origin of Electronic Waste Received:\n\n",null,null,null,null,null,null,null,null,"Weight (lbs) Received for Each Type of CED\n",null,null,"Weight (lbs) Received: for this 6-month reporting period  [Automatically Calculated]           \n                                 "]
["Type of Site","Identify the manufacturer responsible for this weight","Collection Site Operator","Street Address\n (Location of CED drop off)","City or Town","County","Name of Primary Transporter \n(who picks up material from drop-off site)","Secondary Transporter\n (if applicable)","Name of AR\n (processing facility where transporter drops off)","CED Computers & Monitors\n(lbs)","CED TVs\n(lbs)","CED Desktop Printers and Desktop Fax Machines\n(lbs)"]
[null,null,null,null,null,null,null,null,"TOTALS ",{"$f":"SUM(J8:INDEX(J:J,ROWS(J:J)))","v":0},{"$f":"SUM(K8:INDEX(K:K,ROWS(K:K)))","v":0},{"$f":"SUM(L8:INDEX(L:L,ROWS(L:L)))","v":0},{"$f":"SUM(M8:INDEX(M:M,ROWS(M:M)))","v":0}]
["Example: Salvation Army","XYZ Manufacturer","XYZ Public Works Yard","123 Main Street","Anytown","Mercer",null,null,null,120,120,400,{"$f":"SUM(J7:L7)","v":640}]
[null,null,null,null,null,null,null,null,null,null,null,null,0]
[null,null,null,null,null,null,null,null,null,null,null,null,0]
[null,null,null,null,null,null,null,null,null,null,null,null,0]
[null,null,null,null,null,null,null,null,null,null,null,null,0]
[null,null,null,null,null,null,null,null,null,null,null,null,0]
[null,null,null,null,null,null,null,null,null,null,null,null,0]
[null,null,null,null,null,null,null,null,null,null,null,null,0]
[null,null,null,null,null,null,null,null,null,null,null,null,0]
[null,null,null,null,null,null,null,null,null,null,null,null,0]
[null,null,null,null,null,null,null,null,null,null,null,null,0]
[null,null,null,null,null,null,null,null,null,null,null,null,0]
[null,null,null,null,null,null,null,null,null,null,null,null,0]
[null,null,null,null,null,null,null,null,null,null,null,null,0]
[null,null,null,null,null,null,null,null,null,null,null,null,0]
[null,null,null,null,null,null,null,null,null,null,null,null,0]
[null,null,null,null,null,null,null,null,null,null,null,null,0]
[null,null,null,null,null,null,null,null,null,null,null,null,0]
[null,null,null,null,null,null,null,null,null,null,null,null,0]
[null,null,null,null,null,null,null,null,null,null,null,null,0]
[null,null,null,null,null,null,null,null,null,null,null,null,0]
[null,null,null,null,null,null,null,null,null,null,null,null,0]
[null,null,null,null,null,null,null,null,null,null,null,null,0]
[null,null,null,null,null,null,null,null,null,null,null,null,0]
{"$rows_left_out":971}
{"sheet":"2B - Received - Events","index":4,"n_rows":1000,"n_cols":13,"rows_kept":1000,"cut":false,"hidden":false,"merged":[[3,0,3,8],[3,9,3,11]]}
["AR Name:",null,{"$f":"+IF(+'AR Contact Info'!$B$6=\"\",\"[enter name on 'AR Contact Info' tab]\",'AR Contact Info'!$B$6)","v":"[enter name on 'AR Contact Info' tab]"}]
[]
["PART 2B: ORIGIN, MATERIAL TYPE & QUANTITIES OF EACH TYPE OF INCOMING CED COLLECTED/RECEIVED BY AUTHORIZED RECYCLER FROM EVENTS"]
["Origin of Electronic Waste Received:\n\n",null,null,null,null,null,null,null,null,"Weight (lbs) Received for Each Type of CED\n",null,null,"Weight (lbs) Received: for this 6-month reporting period  [Automatically Calculated]           \n                                 "]
["Type of Site","Identify the manufacturer responsible for this weight","Collection Site Operator","Street Address\n (Location of CED drop off)","City or Town","County","Name of Primary Transporter \n(who picks up material from drop-off site)","Secondary Transporter\n (if applicable)","Name of AR\n (processing facility where transporter drops off)","CED Computers & Monitors\n(lbs)","CED TVs\n(lbs)","CED Desktop Printers and Desktop Fax Machines\n(lbs)"]
[null,null,null,null,null,null,null,null,"TOTALS ",{"$f":"SUM(J8:INDEX(J:J,ROWS(J:J)))","v":0},{"$f":"SUM(K8:INDEX(K:K,ROWS(K:K)))","v":0},{"$f":"SUM(L8:INDEX(L:L,ROWS(L:L)))","v":0},{"$f":"SUM(M8:INDEX(M:M,ROWS(M:M)))","v":0}]
["Example: Municipal","XYZ Manufacturer","XYZ Public Works Yard","123 Main Street","Anytown","Middlesex",null,null,null,120,120,400,{"$f":"SUM(J7:L7)","v":640}]
[null,null,null,null,null,null,null,null,null,null,null,null,0]
[null,null,null,null,null,null,null,null,null,null,null,null,0]
[null,null,null,null,null,null,null,null,null,null,null,null,0]
[null,null,null,null,null,null,null,null,null,null,null,null,0]
[null,null,null,null,null,null,null,null,null,null,null,null,0]
[null,null,null,null,null,null,null,null,null,null,null,null,0]
[null,null,null,null,null,null,null,null,null,null,null,null,0]
[null,null,null,null,null,null,null,null,null,null,null,null,0]
[null,null,null,null,null,null,null,null,null,null,null,null,0]
[null,null,null,null,null,null,null,null,null,null,null,null,0]
[null,null,null,null,null,null,null,null,null,null,null,null,0]
[null,null,null,null,null,null,null,null,null,null,null,null,0]
[null,null,null,null,null,null,null,null,null,null,null,null,0]
[null,null,null,null,null,null,null,null,null,null,null,null,0]
[null,null,null,null,null,null,null,null,null,null,null,null,0]
[null,null,null,null,null,null,null,null,null,null,null,null,0]
[null,null,null,null,null,null,null,null,null,null,null,null,0]
[null,null,null,null,null,null,null,null,null,null,null,null,0]
[null,null,null,null,null,null,null,null,null,null,null,null,0]
[null,null,null,null,null,null,null,null,null,null,null,null,0]
[null,null,null,null,null,null,null,null,null,null,null,null,0]
[null,null,null,null,null,null,null,null,null,null,null,null,0]
[null,null,null,null,null,null,null,null,null,null,null,null,0]
{"$rows_left_out":971}
{"sheet":"2C - Received - Miscellaneous","index":5,"n_rows":1000,"n_cols":13,"rows_kept":1000,"cut":false,"hidden":false,"merged":[[3,0,3,8],[3,9,3,11]]}
["AR Name:",null,{"$f":"+IF(+'AR Contact Info'!$B$6=\"\",\"[enter name on 'AR Contact Info' tab]\",'AR Contact Info'!$B$6)","v":"[enter name on 'AR Contact Info' tab]"}]
[]
["PART 2C: ORIGIN, MATERIAL TYPE & QUANTITIES OF EACH TYPE OF INCOMING CED COLLECTED/RECEIVED BY AUTHORIZED RECYCLER "]
["Origin of Electronic Waste Received:\n\n",null,null,null,null,null,null,null,null,"Weight (lbs) Received for Each Type of CED\n",null,null,"Weight (lbs) Received: for this 6-month reporting period  [Automatically Calculated]           \n                                 "]
["Type of Site","Identify the manufacturer responsible for this weight","CED Generator","Street Address\n (Location of CED drop off)","City or Town","County","Name of Primary Transporter \n(who picks up material from drop-off site)","Secondary Transporter\n (if applicable)","Name of AR\n (processing facility where transporter drops off)","CED Computers & Monitors\n(lbs)","CED TVs\n(lbs)","CED Desktop Printers and Desktop Fax Machines\n(lbs)"]
[null,null,null,null,null,null,null,null,"TOTALS ",{"$f":"SUM(J8:INDEX(J:J,ROWS(J:J)))","v":0},{"$f":"SUM(K8:INDEX(K:K,ROWS(K:K)))","v":0},{"$f":"SUM(L8:INDEX(L:L,ROWS(L:L)))","v":0},{"$f":"SUM(M8:INDEX(M:M,ROWS(M:M)))","v":0}]
["Example: Retail","XYZ Manufacturer","NJ CED Solutions","123 Main Street","Anytown","Essex",null,null,null,120,120,400,{"$f":"SUM(J7:L7)","v":640}]
[null,null,null,null,null,null,null,null,null,null,null,null,0]
[null,null,null,null,null,null,null,null,null,null,null,null,0]
[null,null,null,null,null,null,null,null,null,null,null,null,0]
[null,null,null,null,null,null,null,null,null,null,null,null,0]
[null,null,null,null,null,null,null,null,null,null,null,null,0]
[null,null,null,null,null,null,null,null,null,null,null,null,0]
[null,null,null,null,null,null,null,null,null,null,null,null,0]
[null,null,null,null,null,null,null,null,null,null,null,null,0]
[null,null,null,null,null,null,null,null,null,null,null,null,0]
[null,null,null,null,null,null,null,null,null,null,null,null,0]
[null,null,null,null,null,null,null,null,null,null,null,null,0]
[null,null,null,null,null,null,null,null,null,null,null,null,0]
[null,null,null,null,null,null,null,null,null,null,null,null,0]
[null,null,null,null,null,null,null,null,null,null,null,null,0]
[null,null,null,null,null,null,null,null,null,null,null,null,0]
[null,null,null,null,null,null,null,null,null,null,null,null,0]
[null,null,null,null,null,null,null,null,null,null,null,null,0]
[null,null,null,null,null,null,null,null,null,null,null,null,0]
[null,null,null,null,null,null,null,null,null,null,null,null,0]
[null,null,null,null,null,null,null,null,null,null,null,null,0]
[null,null,null,null,null,null,null,null,null,null,null,null,0]
[null,null,null,null,null,null,null,null,null,null,null,null,0]
[null,null,null,null,null,null,null,null,null,null,null,null,0]
{"$rows_left_out":971}
{"sheet":"2D - Weight Received Summary","index":6,"n_rows":6,"n_cols":2,"rows_kept":6,"cut":false,"hidden":false,"merged":[]}
["AR Name:",{"$f":"+IF(+'AR Contact Info'!$B$6=\"\",\"[enter name on 'AR Contact Info' tab]\",'AR Contact Info'!$B$6)","v":"[enter name on 'AR Contact Info' tab]"}]
["Weight Received Summary"]
["Name of Group Plan Administrator or Manufacturer","Total Weight Sold"]
["[One line for each Group or Manufacturer found on tabs 2A, 2B, and 2C]","[Enter total in pounds]"]
["Total Sold:",{"$f":"SUM(B7:INDEX(B:B,ROWS(B:B)))","v":0}]
["EXAMPLE: DS&J Group International",112358]

{"sheet":"3A - Recycled","index":7,"n_rows":998,"n_cols":6,"rows_kept":998,"cut":false,"hidden":false,"merged":[]}
["AR Name:",null,{"$f":"+IF(+'AR Contact Info'!$B$6=\"\",\"[enter name on 'AR Contact Info' tab]\",'AR Contact Info'!$B$6)","v":"[enter name on 'AR Contact Info' tab]"}]
["PART 3A: TYPES, WEIGHT (LBS), AND DESTINATION(S) OF OUTGOING CEDs AND COMPONENTS"]
["Types of Material Recycled Or Refurbished from NJ CEDs ","Please Select One                  Recycled or Refurbished","Downstream Markets or Facilities (after leaving AR)\n\n[Enter Destination Name & Address                                                A separate line should be used for be used for EACH downstream facility]","Total Weight (lbs) Shipped to Downstream Facilities\n","Total Weight (lbs) of Processed CEDs in Storage","Total Weight (lbs) Disposed of as Residue"]
[null,null,"Total",{"$f":"SUM(D6:INDEX(D:D,ROWS(D:D)))","v":0},{"$f":"SUM(E6:INDEX(E:E,ROWS(E:E)))","v":0},{"$f":"SUM(F6:INDEX(F:F,ROWS(F:F)))","v":0}]
["Scrap Metal including wires and cords","Refurbished or Recycled","XYZ Facility - 123 Main Street, Town, State",152.19999999999999,66.3,123.04]
[]
[]
[]
[]
[]
[]
[]
[]
[]
[]
["     "]
["     "]
["     "]
["     "]
["     "]
["     "]
["     "]
["     "]
["     "]
["     "]
["     "]
["     "]
["     "]
["     "]
["     "]
{"$rows_left_out":969}
{"sheet":"3b - Reused - Refurb.","index":8,"n_rows":8,"n_cols":3,"rows_kept":8,"cut":false,"hidden":true,"merged":[[2,0,2,2],[6,0,6,1]]}
["AR Name:",{"$f":"+IF(+'AR Contact Info'!$B$6=\"\",\"[enter name on 'AR Contact Info' tab]\",'AR Contact Info'!$B$6)","v":"[enter name on 'AR Contact Info' tab]"}]
[]
["PART 3B:  TYPES, QUANTITIES (LBS) AND DESTINATIONS OF CEDS REUSED/REFURBISHED\n                  FROM THE REPORTING AR"]
["(Note: Destination may be Authorized Recycler's facility, or another location inside or outside U.S.)"]
[]
["Types of Electronics Reused/ Refurbished \nChoose one CED TVs, CED Computers or CED Printer and fax machines","Reuse / Refurbishment Destination \n\n[Enter Facility Name & Address]","Total Pounds Refurbished / Reused\n(for this 6-month reporting period)\n\n[Enter total in pounds]"]
["Total CEDs Refurbished/Reused",null,{"$f":"SUM(C9:INDEX(C:C,ROWS(C:C)))","v":0}]
["Example: CED Computers","ABC Refurbisher, LLC, 123 Main Street, Anytown, Anywhere",123]

{"sheet":"3B - Disposed","index":9,"n_rows":5,"n_cols":4,"rows_kept":5,"cut":false,"hidden":false,"merged":[[1,0,1,3]]}
["AR Name:",{"$f":"+IF(+'AR Contact Info'!$B$6=\"\",\"[enter name on 'AR Contact Info' tab]\",'AR Contact Info'!$B$6)","v":"[enter name on 'AR Contact Info' tab]"}]
["PART 3B:  TYPES, QUANTITIES (LBS) AND DESTINATIONS OF WASTE RESIDUE SENT FOR DISPOSAL \n                    FROM RECYCLING CEDs "]
["Description of Waste Residue      \n                        \n\n","Disposal Destination \n\n[Enter Destination Name & Address                                                     A separate line should be used for be used for EACH downstream facility]","Disposal Method \n\n[Landfill, Incinerated, Alternate Daily Cover, Other]","Weight in lbs"]
[null,"Total",null,{"$f":"SUM(D6:INDEX(C:C,ROWS(C:C)))","v":0}]
["EXAMPLE: Contaminated Plastic","RRF ABC - 123 Main Street, Town, State","Incinerated",500]

{"sheet":"4e - Percentages","index":10,"n_rows":11,"n_cols":3,"rows_kept":11,"cut":false,"hidden":true,"merged":[[2,0,2,2]]}
["CER Name:",{"$f":"+IF(+'AR Contact Info'!$B$6=\"\",\"[enter name on 'CER Contact Info' tab]\",'AR Contact Info'!$B$6)","v":"[enter name on 'CER Contact Info' tab]"}]
[]
["PART 4: TYPES, QUANTITIES (TONS) AND DESTINATIONS OF MATERIAL SENT OUT FROM THE REPORTING CER"]
[]
["Part 4e – Percentage Recycled and Re-used/Refurbished, Percentage Disposed"]
["(Percentage Recycled should not inlcude portion of materials sent out for recycling by CER that is ultimately disposed)"]
[]
["Type of electronics ","Total Percent of Received Electronic Waste  that was Recycled 1  or  Reused/ Refurbished 2 (by weight) \n(for this 6-month reporting period)\n\n1 - data from tab 4a\n2 - data from tab 4b","Total Percent of Received Electronic Waste that was Directly 3 or Indirectly 4  Disposed (by weight)\n(for this 6-month reporting period)\n\n3 - data from tab 4d\n4 - data from tab 4a"]
["Computers, Monitors, Printers","     "]
["Televisions","     ","     "]
["Non-CEDs","     ","     "]

{"sheet":"3C - Stored","index":11,"n_rows":6,"n_cols":3,"rows_kept":6,"cut":false,"hidden":false,"merged":[[1,0,1,2]]}
["AR Name:",{"$f":"+IF(+'AR Contact Info'!$B$6=\"\",\"[enter name on 'AR Contact Info' tab]\",'AR Contact Info'!$B$6)","v":"[enter name on 'AR Contact Info' tab]"}]
["Part 3C: TYPES AND QUANTITIES (LBS) OF UNPROCESSED NJ CEDs IN STORAGE WAITING TO BE \nPROCESSED OR SHIPPED TO DOWNSTREAM FACILTIES"]
["Description of CEDs Being Stored ","Weight in Storage for report due Aug 1st","Weight in Storage for report due Feb 1st"]
[null,"[Enter total in pounds]","[Enter total in pounds]"]
["Total CEDs Stored",{"$f":"SUM(B7:INDEX(B:B,ROWS(B:B)))","v":0},{"$f":"SUM(C7:INDEX(C:C,ROWS(C:C)))","v":0}]
["EXAMPLE: CED Televisions",52,22]

{"sheet":"4A - CED Weight Sold","index":12,"n_rows":5,"n_cols":3,"rows_kept":5,"cut":false,"hidden":false,"merged":[[1,0,1,2],[4,0,4,1]]}
["AR Name:",{"$f":"+IF(+'AR Contact Info'!$B$6=\"\",\"[enter name on 'AR Contact Info' tab]\",'AR Contact Info'!$B$6)","v":"[enter name on 'AR Contact Info' tab]"}]
["Part 4A: FINANCIAL TRANSACTIONS"]
["Purchaser PI#","Authorized Recycler Purchaser ","Total Weight Sold"]
[null,null,"[Enter total in pounds]"]
["Total Sold:",null,{"$f":"SUM(C6:INDEX(C:C,ROWS(C:C)))","v":0}]

{"sheet":"4B - CED Weight Purchased","index":13,"n_rows":5,"n_cols":3,"rows_kept":5,"cut":false,"hidden":false,"merged":[[1,0,1,2],[4,0,4,1]]}
["AR Name:",{"$f":"+IF(+'AR Contact Info'!$B$6=\"\",\"[enter name on 'AR Contact Info' tab]\",'AR Contact Info'!$B$6)","v":"[enter name on 'AR Contact Info' tab]"}]
["Part 4B: FINANCIAL TRANSACTIONS"]
["Vendor PI#","Authorized Recycler Vendor","Total Weight Purchased"]
[null,null,"[Enter total in pounds]"]
["Total Purchased:",null,{"$f":"SUM(C6:INDEX(C:C,ROWS(C:C)))","v":0}]

{"sheet":"Summary","index":14,"n_rows":16,"n_cols":2,"rows_kept":16,"cut":false,"hidden":false,"merged":[]}
["AR Name:",{"$f":"+IF(+'AR Contact Info'!$B$6=\"\",\"[enter name on 'AR Contact Info' tab]\",'AR Contact Info'!$B$6)","v":"[enter name on 'AR Contact Info' tab]"}]
["Summary Sheet"]
["Pounds of CED TVs Received",{"$f":"'2A - Received - Collection Site'!K6 +  '2B - Received - Events'!K6 +  '2C - Received - Miscellaneous'!K6","v":0}]
["Pounds of CED Computers Received",{"$f":"'2A - Received - Collection Site'!J6 +  '2B - Received - Events'!J6 +  '2C - Received - Miscellaneous'!J6","v":0}]
["Pounds of CED Desktop Printers and Desktop Fax M/C Received",{"$f":"'2A - Received - Collection Site'!L6 +  '2B - Received - Events'!L6 +  '2C - Received - Miscellaneous'!L6","v":0}]
["Total Pounds Received (Collection Site)",{"$f":"'2A - Received - Collection Site'!M6","v":0}]
["Total Pounds Received (Events)",{"$f":" '2B - Received - Events'!M6","v":0}]
["Total Pounds Received (Misc.)",{"$f":"'2C - Received - Miscellaneous'!M6","v":0}]
["Total Pounds Received",{"$f":"'2A - Received - Collection Site'!M6 + '2B - Received - Events'!M6 + '2C - Received - Miscellaneous'!M6","v":0}]
["Total Pounds Recycled",0]
["Total Pounds Refurbished",0]
["Total Pounds Stored (Unprocessed)",{"$f":"SUM('3C - Stored'!B5:C5)","v":0}]
["Total Pounds Stored (Processed)",{"$f":"'3A - Recycled'!E4","v":0}]
["Total Pounds of Residue Disposed",{"$f":"'3B - Disposed'!D4","v":0}]
["Total Pounds of CED Sold",{"$f":"'4A - CED Weight Sold'!C5","v":0}]
["Total Pounds of CED Purchased",{"$f":"'4B - CED Weight Purchased'!C5","v":0}]

{"sheet":"Drop-Downs (do not change)","index":15,"n_rows":36,"n_cols":26,"rows_kept":36,"cut":false,"hidden":true,"merged":[]}
["Batteries",null,"CEDs - Computers",null,null,null,"Contaminated Plastic",null,null,"Incineration with Energy Recovery",null,null,null,null,"Municipal","Municipal","Retail","Refurbished",2017,null,"Landfill","Atlantic",null,"Yes",null,"CED TVs"]
["Glass - Leaded",null,"CEDs - Monitors",null,null,null,"Glass - Leaded",null,null,"Incineration without Energy Recovery",null,null,null,null,"County","County","Mailback","Recycled",2018,null,"Incinerated","Bergen",null,"No",null,"CED Computers"]
["Glass - Non-leaded",null,"CEDs - Printers",null,null,null,"Glass - Non-leaded",null,null,"Land Disposal",null,null,null,null,"Salvation Army","Other","Donation",null,2019,null,"Alternative Daily Cover","Burlington",null,null,null,"CED Desktop Printers & Desktop Fax M/C"]
["LCD/LED Monitor Screen Material",null,"CEDs - Televisions",null,null,null,"Glycol",null,null,"Landfill - ADC (Alternative Daily Cover Material)",null,null,null,null,"Goodwill Dropbox",null,"Premium Service",null,2020,null,"Other","Camden"]
["Mercury-containing Material",null,null,null,null,null,"Other Disposable Material",null,null,null,null,null,null,null,"Goodwill Store",null,"School",null,2021,null,null,"Cape May"]
["Other Recyclable Material",null,null,null,null,null,"PCBs",null,null,null,null,null,null,null,"Other",null,"Other",null,2022,null,null,"Cumberland"]
["Paper / Fiber",null,null,null,null,null,"Plastic film/ Shrink Wrap",null,null,null,null,null,null,null,null,null,null,null,2023,null,null,"Essex"]
["Plastic film/ Shrink Wrap",null,null,null,null,null,"Printed Circuit Board Residue",null,null,null,null,null,null,null,null,null,null,null,2024,null,null,"Gloucester"]
["Plastic Rigid (Light & Dark)",null,null,null,null,null,"Wastewater Sludge / Residue",null,null,null,null,null,null,null,null,null,null,null,2025,null,null,"Hudson"]
["Scrap Metal including wires and cords",null,null,null,null,null,"Wood",null,null,null,null,null,null,null,null,null,null,null,2026,null,null,"Hunterdon"]
["Shredded Circuit Boards",null,null,null,null,null,null,null,null,null,null,null,null,null,null,null,null,null,2027,null,null,"Mercer"]
["Whole Cathode Ray Tubes ",null,null,null,null,null,null,null,null,null,null,null,null,null,null,null,null,null,2028,null,null,"Middlesex"]
["Whole Printed Circuit Boards",null,null,null,null,null,null,null,null,null,null,null,null,null,null,null,null,null,2029,null,null,"Monmouth"]
["Wood",null,null,null,null,null,null,null,null,null,null,null,null,null,null,null,null,null,2030,null,null,"Morris"]
[null,null,null,null,null,null,null,null,null,null,null,null,null,null,null,null,null,null,2031,null,null,"Ocean"]
[null,null,null,null,null,null,null,null,null,null,null,null,null,null,null,null,null,null,2032,null,null,"Passaic"]
[null,null,null,null,null,null,null,null,null,null,null,null,null,null,null,null,null,null,2033,null,null,"Salem"]
["CEDs - Computers",null,null,null,null,null,null,null,null,null,null,null,null,null,null,null,null,null,2034,null,null,"Somerset"]
["CEDs - Monitors",null,null,null,null,null,null,null,null,null,null,null,null,null,null,null,null,null,2035,null,null,"Sussex"]
["CEDs - Printers",null,null,null,null,null,null,null,null,null,null,null,null,null,null,null,null,null,2036,null,null,"Union"]
["CEDs - Televisions",null,null,null,null,null,null,null,null,null,null,null,null,null,null,null,null,null,2037,null,null,"Warren"]
["Batteries",null,null,null,null,null,null,null,null,null,null,null,null,null,null,null,null,null,2038]
["Glass - Leaded",null,null,null,null,null,null,null,null,null,null,null,null,null,null,null,null,null,2039]
["Glass - Non-leaded",null,null,null,null,null,null,null,null,null,null,null,null,null,null,null,null,null,2040]
["Glycol"]
["LCD/LED Monitor Screen Material"]
["Mercury-containing Material"]
["Paper / Fiber"]
["Plastic Film/ Shrink Wrap"]
["Plastic Rigid (Light & Dark)"]
{"$rows_left_out":7}
{"sheet":"Sheet2","index":16,"n_rows":0,"n_cols":0,"rows_kept":0,"cut":false,"hidden":true,"merged":[]}