{"text_format":"1","workbook":"xlsx","n_sheets":9,"sheets":["Master database","foc calc","MGW-ExistChem","MGW-NewChem","MGW-DAF","MGW-SPLP-ExistChem","MGW-SPLP-NewChem","MGW-SPLP-PFAS","Sheet1"],"not_rendered":{"charts":0,"images":45,"macros":1,"external_links":0,"defined_names":6,"comments":0,"pivot_tables":0},"unopened":[],"bounds":{"document_bytes":16777216,"sheet_cells":100000,"rows_first":2000,"rows_last":500,"rows_between":2000,"halvings":0,"cell_chars":16384,"cell_head_chars":4096},"cells_cut":0,"cells_raw":0,"read":"whole","date_system":"1900"}

{"sheet":"Master database","index":0,"n_rows":227,"n_cols":12,"rows_kept":227,"cut":false,"hidden":false,"merged":[[210,1,210,2],[211,1,211,2],[224,1,224,2],[225,1,225,2]]}
[null,"Chemical","CAS No. ","2018 Standards Ground water practical quantitation level (µg/L)","2018 Standards Ground Water Remediation Standard (µg/L)","2018 Standards Soil Reporting Limit (mg/kg)","2018 Standards Ambient background (mg/kg)","2018 Standards Water Solubility (mg/L)","2018 Standards Henry's Law Constant (atm-m3/mol),25°C","2018 Standards Henry's Law Constant (dimensionless, 25°C)","2018 Standards Koc (L/kg)","2018 Standards Kd (L/kg)"]
[1,"Acenaphthene","83-32-9",10,400,0.17,"NA",3.9,1.84E-4,7.5224000000000003E-3,5027,"NA"]
[3,"Acetone (2-Propanone)","67-64-1",10,6000,0.01,"NA",1000000,3.4999999999999997E-5,1.4308999999999999E-3,2.3639999999999999,"NA"]
[4,"Acetophenone","98-86-2",10,700,0.33,"NA",6130,1.04E-5,4.2517999999999999E-4,51.85,"NA"]
[7,"Aldrin","309-00-2",0.04,0.04,1.6999999999999999E-3,"NA",1.7000000000000001E-2,4.3999999999999999E-5,1.7989E-3,82020,"NA"]
[8,"Aluminum (total)","7429-90-5",30,"NA",20,"NA","NA",0,0,"NA",1500]
[9,"Anthracene","120-12-7",10,2000,0.17,"NA",4.3400000000000001E-2,5.5600000000000003E-5,2.2731000000000001E-3,16360,"NA"]
[10,"Antimony (total)","7440-36-0",3,6,1,"NA","NA",0,0,"NA",45]
[11,"Arsenic (total)","7440-38-2",3,3,0.5,19,"NA",0,0,"NA",26]
[12,"Atrazine","1912-24-9",0.1,3,0.33,"NA",34.700000000000003,2.3600000000000001E-9,9.6484000000000006E-8,224.5,"NA"]
[13,"Barium (total)","7440-39-3",200,6000,5,"NA","NA",0,0,"NA",17]
[14,"Benzaldehyde","100-52-7","NA","NA",0.33,"NA",6950,2.6699999999999998E-5,1.0916000000000001E-3,11.09,"NA"]
[15,"Benzene","71-43-2",1,1,5.0000000000000001E-3,"NA",1790,5.5500000000000002E-3,0.22690109999999999,145.80000000000001,"NA"]
[17,"Benzo(a)anthracene (1,2-Benzanthracene)","56-55-3",0.1,0.1,0.17,"NA",9.4000000000000004E-3,1.2E-5,4.9058999999999995E-4,176900,"NA"]
[18,"Benzo(a)pyrene","50-32-8",0.1,0.1,0.17,"NA",1.6199999999999999E-3,4.5699999999999998E-7,1.8683000000000001E-5,587400,"NA"]
{"$rows_left_out":213}
{"sheet":"foc calc","index":1,"n_rows":22,"n_cols":13,"rows_kept":22,"cut":false,"hidden":false,"merged":[[30,0,30,3],[11,2,12,9],[13,2,13,3],[16,2,16,7],[29,0,29,3],[21,2,23,9],[3,12,3,15],[4,1,5,1],[4,2,5,9],[7,2,7,4],[8,2,8,4],[9,2,9,4],[0,0,0,9],[1,0,1,1],[1,2,1,6],[1,8,1,9],[2,0,2,1],[2,2,2,6],[2,8,2,9]]}
["NJDEP 2023 Organic Carbon Calculator"]
["Site Name:",null,null,null,null,null,null,"Date:",null,null,null,null,"Calculated or locked cell"]
["Additional Description:",null,null,null,null,null,null,"Evaluated by:",null,null,null,null,"Required data entry"]
[null,null,null,null,null,null,null,null,null,null,null,null,"Optional data entry"]
[null,"Total organic carbon (mg/kg)","Enter up to 20 total organic carbon content values in the outlined cells.  Use units of mg/kg. Leave unused cells blank. Reset button will clear entries."]
[]
[]
[null,null,"Maximum organic carbon =",null,null,{"$f":"MAX(B7:B26)","v":0},"mg/kg"]
[null,null,"Minimum organic carbon =",null,null,{"$f":"MIN(B7:B26)","v":0},"mg/kg"]
[null,null,"Maxium/Minimum = ",null,null,{"$f":"F8/F9","v":{"$error":"#DIV/0!"}}]
[null,null,"Average organic carbon = ",null,null,{"$f":"AVERAGE(B7:B26)","v":{"$error":"#DIV/0!"}},"mg/kg"]
[null,null,{"$f":"IF(F10>10,\"Organic carbon contents vary by more than an order of magnitude.  Use minimum organic carbon content (maximum for MGW SESOIL/AT123D option).\",\"\")","v":{"$error":"#DIV/0!"}}]
[]
[]
[]
{"$rows_left_out":8}
{"sheet":"MGW-ExistChem","index":2,"n_rows":136,"n_cols":79,"rows_kept":136,"cut":false,"hidden":false,"merged":[[33,0,33,8],[41,0,41,3],[42,0,42,3],[23,1,23,2],[24,1,24,2],[25,1,25,4],[26,1,26,4],[31,3,31,4],[31,5,31,6],[8,11,8,12],[14,5,14,6],[19,1,19,2],[20,1,20,2],[21,1,21,2],[22,1,22,2],[0,0,0,9],[1,0,1,1],[1,2,1,6],[1,8,1,9],[2,0,3,1],[2,2,3,6],[2,8,2,9],[3,8,3,9]]}
["NJDEP 2023 Soil-Water Partition Equation Calculator",null,null,null,null,null,null,null,null,null,null,null,null,null,null,null,null,null,null,null,null,null,null,"Acenaphthene","83-32-9"]
["Site Name:",null,null,null,null,null,null,"Date:",null,null,null,null,"Calculated or locked cell",null,null,null,null,null,null,null,null,null,null,"Acetone (2-Propanone)","67-64-1"]
["Contaminant:",null,null,null,null,null,null,"CAS No.:",{"$f":"CA100","v":"83-32-9"},null,null,null,"Required data entry",null,null,null,null,null,null,null,null,null,null,"Acetophenone","98-86-2"]
[null,null,null,null,null,null,null,"Evaluated by:",null,null,null,null,"Optional data entry/modification",null,null,null,null,null,null,null,null,null,null,"Aldrin","309-00-2"]
[null,null,null,null,null,null,null,null,null,null,null,null,null,null,null,null,null,null,null,null,null,null,null,"Aluminum (total)","7429-90-5"]
[null,null,null,null,null,null,null,null,null,null,null,null,null,null,null,null,null,null,null,null,null,null,null,"Anthracene","120-12-7"]
[null,null,null,null,null,null,null,null,null,null,null,null,null,null,null,null,null,null,null,null,null,null,null,"Antimony (total)","7440-36-0"]
["Contaminant Parameters:",null,null,null,null,"Soil Parameters:",null,null,null,null,null,null,null,null,null,null,null,null,null,null,null,null,null,"Arsenic (total)","7440-38-2"]
["Parameter","Definition","Units","Value",null,"Parameter","Definition","Units","Value",null,null,null,null,null,null,null,null,null,null,null,null,null,null,"Atrazine","1912-24-9"]
["GWRS","Ground Water Remediation Standard","µg/L",{"$f":"VLOOKUP(I3,'Master database'!$C$2:$GP$455,MATCH(\"2018 Standards Ground Water Remediation Standard (µg/L)\",'Master database'!$C$1:$GP$1,0),FALSE)","v":400},null,"θw","Water-filled soil porosity","dimensionless (v/v)",0.23,null,null,null,null,null,null,null,null,null,null,null,null,null,null,"Barium (total)","7440-39-3"]
["Koc","Soil Organic Carbon-Water Partition Coefficient","L/kg",{"$f":"VLOOKUP(I3,'Master database'!$C$2:$GP$455,MATCH(\"2018 Standards Koc (L/kg)\",'Master database'!$C$1:$GP$1,0),FALSE)","v":5027},null,"θa","Air-filled Soil Porosity","dimensionless (v/v)",0.18,null,null,null,null,null,null,null,null,null,null,null,null,null,null,"Benzaldehyde","100-52-7"]
["Kd","Soil-Water Partition Coefficient","L/kg",{"$f":"IF(D11=\"NA\",VLOOKUP(I3,'Master database'!$C$2:$GP$455,MATCH(\"2018 Standards Kd (L/kg)\",'Master database'!$C$1:$GP$1,0),FALSE),D11*I12)","v":10.054},null,"foc","(Fraction) Organic Carbon Content of Soil","dimensionless (w/w)",2E-3,{"$f":"IF(OR(I12>1,I12<0),\"out of range\",IF(I12<>0.002,\"changed\",\"\"))","v":""},null,null,null,null,null,null,null,null,null,null,null,null,null,"Benzene","71-43-2"]
["H'","Henry's Law Constant","dimensionless",{"$f":"VLOOKUP(I3,'Master database'!$C$2:$GP$455,MATCH(\"2018 Standards Henry's Law Constant (dimensionless, 25°C)\",'Master database'!$C$1:$GP$1,0),FALSE)","v":7.5224000000000003E-3},null,"ρb","Dry Soil Bulk Density","kg/L",1.5,null,null,null,null,null,null,null,null,null,null,null,null,null,null,"Benzo(a)anthracene (1,2-Benzanthracene)","56-55-3"]
["S","Water Solubility","mg/L",{"$f":"VLOOKUP(I3,'Master database'!$C$2:$GP$455,MATCH(\"2018 Standards Water Solubility (mg/L)\",'Master database'!$C$1:$GP$1,0),FALSE)","v":3.9},null,null,null,null,null,null,null,null,null,null,null,null,null,null,null,null,null,null,null,"Benzo(a)pyrene","50-32-8"]
["RLsoil","Soil Reporting Limit","mg/kg",{"$f":"VLOOKUP(I3,'Master database'!$C$2:$GP$455,MATCH(\"2018 Standards Soil Reporting Limit (mg/kg)\",'Master database'!$C$1:$GP$1,0),FALSE)","v":0.17},null,null,null,null,null,null,null,null,null,null,null,null,null,null,null,null,null,null,null,"Benzo(b)fluoranthene (3,4-Benzofluoranthene)","205-99-2"]
{"$rows_left_out":122}
{"sheet":"MGW-NewChem","index":3,"n_rows":38,"n_cols":13,"rows_kept":38,"cut":false,"hidden":false,"merged":[[29,0,29,8],[38,3,38,4],[41,0,41,3],[42,0,42,3],[22,1,22,2],[23,1,23,4],[24,1,24,4],[25,5,25,6],[26,0,26,8],[27,3,27,4],[27,5,27,6],[6,11,6,12],[17,1,17,2],[18,1,18,2],[19,1,19,2],[20,1,20,2],[21,1,21,2],[0,0,0,9],[1,0,1,1],[1,2,1,6],[1,8,1,9],[2,0,3,1],[2,2,3,6],[2,8,2,9],[3,8,3,9]]}
["NJDEP 2023 Soil-Water Partition Equation Calculator"]
["Site Name:",null,null,null,null,null,null,"Date:",null,null,null,null,"Calculated or locked cell"]
["Contaminant:",null,null,null,null,null,null,"CAS No.:",null,null,null,null,"Required data entry"]
[null,null,null,null,null,null,null,"Evaluated by:",null,null,null,null,"Optional data entry/modification"]
[]
[]
[]
["Contaminant Parameters:",null,null,null,null,"Soil Parameters:"]
["Parameter","Definition","Units","Value",null,"Parameter","Definition","Units","Value"]
["GWRS","Ground Water Remediation Standard","µg/L","Enter Value Here",null,"θw","Water-filled soil porosity","dimensionless (v/v)",0.23]
["Koc","Soil Organic Carbon-Water Partition Coefficient","L/kg",null,null,"θa","Air-filled Soil Porosity","dimensionless (v/v)",0.18]
["Kd","Soil-Water Partition Coefficient","L/kg",null,null,"foc","(Fraction) Organic Carbon Content of Soil","dimensionless (w/w)",2E-3,{"$f":"IF(OR(I12>1,I12<0),\"out of range\",IF(I12<>0.002,\"changed\",\"\"))","v":""}]
["H'","Henry's Law Constant","dimensionless","Enter Value Here or Zero",null,"ρb","Dry Soil Bulk Density","kg/L",1.5]
["S","Water Solubility","mg/L","Enter Value Here or NA"]
["Csat","Soil Saturation Limit","mg/kg",{"$f":"IF($D$14=\"NA\",\"NA\",IF(ISERROR($D$14/$I$13*($D$37*$I$13+$I$10+$D$13*$I$11)),\"\",Round_to_Even($D$14/$I$13*($D$37*$I$13+$I$10+$D$13*$I$11))))","v":""}]
{"$rows_left_out":24}
{"sheet":"MGW-DAF","index":4,"n_rows":16,"n_cols":13,"rows_kept":16,"cut":false,"hidden":false,"merged":[[15,2,15,5],[25,0,25,3],[26,0,26,3],[9,2,9,3],[10,2,10,3],[11,2,11,3],[12,2,12,3],[13,2,13,3],[14,2,14,5],[0,0,0,9],[1,0,1,1],[1,2,1,6],[1,8,1,9],[2,0,2,1],[2,2,2,6],[2,8,2,9]]}
["NJDEP 2023 Migration to Ground Water Dilution-Attenuation Factor Calculator"]
["Site Name:",null,null,null,null,null,null,"Date:",null,null,null,null,"Calculated or locked cell"]
["Additional Description:",null,null,null,null,null,null,"Evaluated by:",null,null,null,null,"Required data entry"]
[null,null,null,null,null,null,null,null,null,null,null,null,"Optional data entry/modification"]
[]
[]
[]
[null,null,null,null,null,null,"Converted to metric:"]
[null,"Parameter","Definition",null,"Value","units","Value","units"]
[null,"L","Length of Area of Concern Parallel to Ground Water Flow",null,100,"ft",{"$f":"E10*0.3048","v":30.48},"m",{"$f":"IF(E10<0,\"out of range\",IF(E10<>100,\"changed\",\"\"))","v":""}]
[null,"da","Aquifer Thickness",null,11.5,"ft",{"$f":"E11*0.3048","v":3.5052000000000003},"m",{"$f":"IF(E11<0,\"out of range\",IF(E11<>11.5,\"changed\",\"\"))","v":""}]
[null,"I","Infiltration Rate",null,11,"in/yr",{"$f":"E12*0.0254","v":0.27939999999999998},"m/yr"]
[null,"K","Aquifer Hydraulic Conductivity",null,51865,"ft/yr",{"$f":"E13*0.3048","v":15808.452000000001},"m/yr",{"$f":"IF(E13<0,\"out of range\",IF(E13<>51865,\"changed\",\"\"))","v":""}]
[null,"i","Gradient",null,3.0000000000000001E-3,"dimensionless",{"$f":"E14","v":3.0000000000000001E-3},"dimensionless",{"$f":"IF(OR(E14<0,E14>1),\"out of range\",IF(E14<>0.003,\"changed\",\"\"))","v":""}]
[null,"d","Mixing Zone Depth",null,null,null,{"$f":"IF((0.0112*G10^2)^0.5+G11*(1-EXP((-G10*G12)/(G13*G14*G11)))>G11,G11,(0.0112*G10^2)^0.5+G11*(1-EXP((-G10*G12)/(G13*G14*G11))))","v":3.4007467135056353},"m"]
{"$rows_left_out":2}
{"sheet":"MGW-SPLP-ExistChem","index":5,"n_rows":136,"n_cols":79,"rows_kept":136,"cut":false,"hidden":false,"merged":[[15,11,16,11],[15,12,16,12],[15,13,16,13],[15,14,16,14],[15,2,16,2],[15,3,16,3],[15,4,16,4],[15,5,16,5],[15,6,15,9],[15,10,16,10],[15,0,16,0],[15,1,16,1],[0,0,0,4],[1,1,1,3],[2,1,2,3],[3,1,3,3],[6,0,6,1],[8,0,8,1],[9,0,9,1],[10,0,10,1],[11,0,11,1],[12,0,12,1],[13,0,13,1]]}
["NJDEP 2023 SPLP Spreadsheet",null,null,null,null,null,null,null,null,null,null,null,null,null,null,null,null,null,null,null,null,null,null,"Acenaphthene","83-32-9"]
["Case name/area of concern:",null,null,null,null,null,null,null,null,null,null,null,null,null,null,null,null,null,null,null,null,null,null,"Acetone (2-Propanone)","67-64-1"]
["Case number:",null,null,null,null,null,null,null,null,null,null,null,null,null,null,null,null,null,null,null,null,null,null,"Acetophenone","98-86-2"]
["Sampling date:",null,null,null,null,null,null,null,null,null,null,null,null,null,null,null,null,null,null,null,null,null,null,"Aldrin","309-00-2"]
[null,null,null,null,null,null,null,null,null,null,null,null,null,null,null,null,null,null,null,null,null,null,null,"Aluminum (total)","7429-90-5"]
["Contaminant:",null,null,null,"NOTE:",null,null,null,null,null,null,null,null,null,null,null,null,"check columns - to verify that data has not changed",null,null,null,null,null,"Anthracene","120-12-7"]
["CAS No:",null,{"$f":"CA100","v":"83-32-9"},null,"USE ONE PAGE PER CONTAMINANT, do not leave empty rows between samples",null,null,null,null,null,null,null,null,null,null,null,null,null,null,null,null,null,null,"Antimony (total)","7440-36-0"]
["Water solubility (mg/L)",null,{"$f":"VLOOKUP(C7,'Master database'!$C$2:$GP$455,MATCH(\"2018 Standards Water Solubility (mg/L)\",'Master database'!$C$1:$GP$1,0),FALSE)","v":3.9},null,"Do not enter samples with soil concentrations at or below the soil reporting limit",null,null,null,null,null,null,null,null,null,null,null,null,null,null,null,null,null,null,"Arsenic (total)","7440-38-2"]
["Aqueous reporting limit (µg/L):",null,{"$f":"VLOOKUP(C7,'Master database'!$C$2:$GP$455,MATCH(\"2018 Standards Ground water practical quantitation level (µg/L)\",'Master database'!$C$1:$GP$1,0),FALSE)","v":10},null,"SPLP leachate concentrations may be entered down to the detection limit, but see guidance",null,null,null,null,null,null,null,null,null,null,null,null,null,null,null,null,null,null,"Atrazine","1912-24-9"]
["Soil reporting limit (mg/kg):",null,{"$f":"VLOOKUP(C7,'Master database'!$C$2:$GP$455,MATCH(\"2018 Standards Soil Reporting Limit (mg/kg)\",'Master database'!$C$1:$GP$1,0),FALSE)","v":0.17},null,"Enter site-specific dilution-attenuation factor (DAF) if desired",null,null,null,null,null,null,null,null,null,null,null,null,null,null,null,null,null,null,"Barium (total)","7440-39-3"]
["Ground Water Remediation Std (µg/L)",null,{"$f":"VLOOKUP(C7,'Master database'!$C$2:$GP$455,MATCH(\"2018 Standards Ground Water Remediation Standard (µg/L)\",'Master database'!$C$1:$GP$1,0),FALSE)","v":400},null,null,"Data entry cells (do not skip rows)",null,null,null,null,null,null,null,null,null,null,null,null,null,null,null,null,null,"Benzaldehyde","100-52-7"]
["DAF (20, or site-specific if approved):",null,20,{"$f":"IF(C12<>20,\"changed\",\"\")","v":""},null,"Optional data entry",null,null,null,null,null,null,null,null,null,null,null,null,null,null,null,null,null,"Benzene","71-43-2"]
["Leachate Standard (µg/L):",null,{"$f":"IF(C11=\"NA\",\"NA\",IF(AND(C8<>\"NA\",(C11*C12)/1000>C8), \"NA\",Round_to_Even(C11*C12)))","v":"NA"},{"$f":"IF(C11=\"NA\",\"no GWRS\",IF(AND(C8<>\"NA\",(C11*C12)/1000>C8),\"above Csat\",\"\"))","v":"above Csat"},null,"Calculated or locked cells",null,null,null,null,null,null,null,null,null,null,null,null,null,null,null,null,null,"Benzo(a)anthracene (1,2-Benzanthracene)","56-55-3"]
["Henry's law constant (dimensionless):",null,{"$f":"VLOOKUP(C7,'Master database'!$C$2:$GP$455,MATCH(\"2018 Standards Henry's Law Constant (dimensionless, 25°C)\",'Master database'!$C$1:$GP$1,0),FALSE)","v":7.5224000000000003E-3},null,null,"Indicates that Alternative Remediation Standard needs to be recalculated",null,null,null,null,null,null,null,null,null,null,null,null,null,null,null,null,null,"Benzo(a)pyrene","50-32-8"]
[null,null,null,null,null,null,null,null,null,null,null,null,null,null,null,null,null,null,null,null,null,null,null,"Benzo(b)fluoranthene (3,4-Benzofluoranthene)","205-99-2"]
{"$rows_left_out":122}
{"sheet":"MGW-SPLP-NewChem","index":6,"n_rows":17,"n_cols":18,"rows_kept":17,"cut":false,"hidden":false,"merged":[[15,14,16,14],[15,0,16,0],[15,1,16,1],[15,2,16,2],[15,3,16,3],[15,4,16,4],[15,5,16,5],[15,6,15,9],[15,10,16,10],[15,11,16,11],[15,12,16,12],[15,13,16,13],[13,0,13,1],[0,0,0,4],[1,1,1,3],[2,1,2,3],[3,1,3,3],[5,1,5,3],[6,0,6,1],[8,0,8,1],[9,0,9,1],[10,0,10,1],[11,0,11,1],[12,0,12,1]]}
["NJDEP 2023 SPLP Spreadsheet"]
["Case name/area of concern:"]
["Case number:"]
["Sampling date:"]
[]
["Contaminant:",null,null,null,"NOTE:",null,null,null,null,null,null,null,null,null,null,null,null,"check columns - to verify that data has not changed"]
["CAS No:",null,null,null,"USE ONE PAGE PER CONTAMINANT, do not leave empty rows between samples"]
["Water solubility (mg/L)",null,null,null,"Do not enter samples with soil concentrations at or below the soil reporting limit."]
["Aqueous reporting limit (µg/L):",null,null,null,"SPLP leachate concentrations may be entered down to the detection limit, but see guidance"]
["Soil reporting limit (mg/kg):",null,null,null,"Enter site-specific dilution-attenuation factor (DAF) if desired"]
["Ground Water Criterion (µg/L)",null,null,null,null,"Data entry cells (do not skip rows)"]
["DAF (20, or site-specific if approved):",null,20,{"$f":"IF(C12<>20,\"changed\",\"\")","v":""},null,"Optional data entry"]
["Leachate Criterion (µg/L):",null,{"$f":"IF(C11=\"NA\",\"NA\",IF(AND(C8<>\"NA\",(C11*C12)/1000>C8),\"NA\",Round_to_Even(C11*C12)))","v":0},{"$f":"IF(C11=\"NA\",\"no GWRS\",IF(AND(C8<>\"NA\",(C11*C12)/1000>C8),\"above Csat\",\"\"))","v":""},null,"Calculated or locked cells"]
["Henry's law constant (dimensionless):",null,null,null,null,"Indicates that Alternative Remediation Standard needs to be recalculated"]
[]
{"$rows_left_out":3}
{"sheet":"MGW-SPLP-PFAS","index":7,"n_rows":100,"n_cols":79,"rows_kept":100,"cut":false,"hidden":false,"merged":[[15,0,16,0],[15,1,16,1],[0,0,0,4],[1,1,1,3],[2,1,2,3],[3,1,3,3],[6,0,6,1],[8,0,8,1],[9,0,9,1],[10,0,10,1],[11,0,11,1],[12,0,12,1],[13,0,13,1],[15,11,16,11],[15,12,16,12],[15,13,16,13],[15,14,16,14],[15,2,16,2],[15,3,16,3],[15,4,16,4],[15,5,16,5],[15,6,15,9],[15,10,16,10]]}
["NJDEP 2023 PFAS SPLP Spreadsheet",null,null,null,null,null,null,null,null,null,null,null,null,null,null,null,null,null,null,null,null,null,null,"HFPO-DA (GenX)","13252-13-6 & 62037-80-3"]
["Case name/area of concern:",null,null,null,null,null,null,null,null,null,null,null,null,null,null,null,null,null,null,null,null,null,null,"Perfluorononanoic Acid (PFNA)","375-95-1"]
["Case number:",null,null,null,null,null,null,null,null,null,null,null,null,null,null,null,null,null,null,null,null,null,null,"Perfluorooctanoic Acid (PFOA)","335-67-1"]
["Sampling date:",null,null,null,null,null,null,null,null,null,null,null,null,null,null,null,null,null,null,null,null,null,null,"Perfluorooctane Sulfonate (PFOS)","1763-23-1"]
[]
["Contaminant:",null,null,null,"NOTE:",null,null,null,null,null,null,null,null,null,null,null,null,"check columns - to verify that data has not changed"]
["CAS No:",null,{"$f":"CA100","v":"13252-13-6 & 62037-80-3"},null,"USE ONE PAGE PER CONTAMINANT, do not leave empty rows between samples"]
["Water solubility (mg/L)",null,{"$f":"VLOOKUP(C7,'Master database'!$C$2:$GP$455,MATCH(\"2018 Standards Water Solubility (mg/L)\",'Master database'!$C$1:$GP$1,0),FALSE)","v":"NA"},null,"Do not enter samples with soil concentrations at or below the soil reporting limit"]
["Laboratory-specific aqueous reporting limit (µg/L):",null,null,null,"SPLP leachate concentrations may be entered down to the detection limit, but see guidance"]
["Laboratory-specific soil reporting limit (mg/kg):",null,null,null,"Enter site-specific dilution-attenuation factor (DAF) if desired"]
["Ground Water Remediation Std (µg/L)",null,{"$f":"VLOOKUP(C7,'Master database'!$C$2:$GP$455,MATCH(\"2018 Standards Ground Water Remediation Standard (µg/L)\",'Master database'!$C$1:$GP$1,0),FALSE)","v":0.02},null,null,"Data entry cells (do not skip rows)"]
["DAF (20, or site-specific if approved):",null,20,{"$f":"IF(C12<>20,\"changed\",\"\")","v":""},null,"Optional data entry"]
["Leachate Standard (µg/L):",null,{"$f":"IF(C11=\"NA\",\"NA\",IF(AND(C8<>\"NA\",(C11*C12)/1000>C8), \"NA\",Round_to_Even(C11*C12)))","v":0.4},{"$f":"IF(C11=\"NA\",\"no GWRS\",IF(AND(C8<>\"NA\",(C11*C12)/1000>C8),\"above Csat\",\"\"))","v":""},null,"Calculated or locked cells"]
["Henry's law constant (dimensionless):",null,{"$f":"VLOOKUP(C7,'Master database'!$C$2:$GP$455,MATCH(\"2018 Standards Henry's Law Constant (dimensionless, 25°C)\",'Master database'!$C$1:$GP$1,0),FALSE)","v":0},null,null,"Indicates that Alternative Remediation Standard needs to be recalculated"]
[]
{"$rows_left_out":86}
{"sheet":"Sheet1","index":8,"n_rows":0,"n_cols":0,"rows_kept":0,"cut":false,"hidden":false,"merged":[]}