{"text_format":"1","workbook":"xlsx","n_sheets":9,"sheets":["CID Revision Project Overview","AOC Tracking Sheet","Column Instructions","AOC Sheet Layout1","Sample AOC Tracking","AOC Tracking","Dropdowns","For CGI-migration help","CID Validations"],"not_rendered":{"charts":0,"images":0,"macros":1,"external_links":0,"defined_names":62,"comments":1,"pivot_tables":0},"unopened":[],"bounds":{"document_bytes":16777216,"sheet_cells":100000,"rows_first":2000,"rows_last":500,"rows_between":2000,"halvings":0,"cell_chars":16384,"cell_head_chars":4096},"cells_cut":0,"cells_raw":0,"read":"whole","date_system":"1900"}

{"sheet":"CID Revision Project Overview","index":0,"n_rows":17,"n_cols":4,"rows_kept":17,"cut":false,"hidden":true,"merged":[]}
[null,"Develop Macro Enabled CID"]
[null,"The requirements here were built on a new sheet in an unlocked CID.  To get a current CID with restrictions and hidden sheets, download from SRP forms page.  In the new CID, the 'For CGI Migration' and 'Dropdowns' Tabs (if needed) should be hidden.  There should be visible tabs for AOC Tracking, Sample AOC Tracking, and Instructions.  Tabs with new CID Requirements are 'CID Revision Project Overview' and 'Sample AOC Tracking'. "]
[]
[null,"Requirement","Detail","Consequence"]
[1,"User can copy and paste and not corrupt hidden columns","User Will work on Sheet 2 which will not contain the hidden columns","All CIDs will need to be converted to New Format"]
[2,"All CIDs will need to be converted to New Format","User will email in CID and processor will convert and email back"]
[3,"Add Validate for Upload button at D1, conditionally change button to Enable for Editing, OR put Enable for Editing Button at D2","Vlookups CGI imports look like this in Col C \"=VLOOKUP(B6,Dropdowns!$A$2:$B$49,2,FALSE)\" , and Col G \"=VLOOKUP(F6,Dropdowns!$D$2:$E$23,2,FALSE)\"  They evaluate this to make sure they imported the code from the correct Row (these are from the first import row so reflect row 6 of the sheet)"]
[4,"Macros will populate user's data, corresponding codes and formulas to hidden Sheet 1 when user clicks Validate for Upload button","CGI uploads from sheet 1,starts at row 6"]
[5,"Macros build hidden formulas on sheet 1, col C and G"]
[6,"New user column 'Included in Fee Calculation', at Column F.  Col F will be saved to Sheet 1 Col W for CGI.","CGI uploads from sheet 1, CGI will be importing Col W but user should see at Col F","Consider in  the CID conversion email process."]
[7,"CID will have internal conditional validations/prevent upload until validations are run","User will click a button 'Validate for Upload' (possibly in Cell D1) which will run internal validations and populate cell C1 with current internal CID version number (which will be advanced to 1.3 (existing system option), preventing old CIDs from being uploaded).  User will click another button to clear C1 and enable editing.","Validations are described in the AOC tracking sheet.  Current error message says User has the wrong Version number.  Add to the error message\" \"or click the Validate for Upload\" button before loading.\""]
[8,"Add Activity Number to CID","Label in A3, value in B3, validate that it 'looks' like an activity number, format 'ABC123456'"]
[9,"Turn cell text Red if over 100 char in col AOC ID, 500 in AOC Description and 4000 in Activity Column."]
[9,"Remove existing directions  in E1, E2.  E3 is OK if we are turning text red for having too many characters."]
[10,"Row height will auto adjust to text entered."]
[11,"Type ahead for Dropdowns, especially AOC Type and Contaminants of Concern."]
[12,"Go to the sheet 'Sample AOC Tracking' for Column specs and Validations"]

{"sheet":"AOC Tracking Sheet","index":1,"n_rows":5,"n_cols":20,"rows_kept":5,"cut":false,"hidden":false,"merged":[]}
["Case Name:",null,"IMPORTANT: ","1) The CID must be FINALIZED prior to upload. After the CID has been populated, click the Validate for Upload button and follow the instructions."]
["PI #:",null,null,"2) You MUST SAVE after finalizing, and before upload. Click the Enable for Editing button after uploading to edit again."]
["Activity #:"]
["Case Inventory Document   Version  1.5.1   02/04/21"]
["AOC ID","AOC Type ","AOC Description","Confirmed Contamination","Exclude AOC from Billing","AOC Status Achieved","Status Achieved Date","Incident Communication Center #s Managed in Case","NJDEP ID","Contaminated Media","Contaminants of Concern ","Additional Contaminants of Concern ","Additional Contaminants of Concern ","Applicable Remediation Standard","Exposure Route","Additional\nExposure Route","RA Type","Additional\nRA Type","Was an Order of Magnitude Evaluation Conducted?","Activity"]

{"sheet":"Column Instructions","index":2,"n_rows":2,"n_cols":2,"rows_kept":2,"cut":false,"hidden":false,"merged":[]}
["CID Column","Instruction"]
["General Instructions","The CID must be kept in the .xlsm format.  Do not right click the CID file and use \"Save as...\".  The CID will not work if converted to another format.  The file CAN be copied and pasted, then renamed, but must retain the .xlsm extension.\nFor more detailed information and instructions, please click inside this cell."]

{"sheet":"AOC Sheet Layout1","index":3,"n_rows":13,"n_cols":24,"rows_kept":13,"cut":false,"hidden":true,"merged":[]}
[null,null,"This sheet will be in the CID with a few example rows"]
[null,null,"This is the guidance for building the new CID visible page, import page and validations."]
["Column\nPosition in Editable Sheet","A","B","Null","C","D","E","F","Null","G","H","I","J","K","L","M","N","O","P","Q","R","T-REMOVED","S","T"]
["Save to Column to hidden sheet 1 for upload by CGI","A","B","C","D","E","V","F","G","H","I","J","K","L","M","N","O","P","Q","R","S","REMOVED","T","U"]
["Column Name","AOC ID","AOC Type ","AOC Code"," AOC Description","Confirmed Contamination","Exclude AOC from Billing","AOC Status","AOC Status Code","Status Date","Incident #","DEP AOC Number","Contaminated Media","Contaminants of Concern ","Additional Contaminants of Concern ","Additional Contaminants of Concern ","Applicable Remediation Standard","Exposure Route","Additional Exposure Route","RA Type","Additional RA Type","Additional RA Type","Was an Order of Magnitude Evaluation Conducted?","Activity"]
["Example Row ","AOC1","Storage tank and appurtenance - State or Federal Regulated underground storage tank","ASUF","Current UST Field: 3/10,000-gallon unleaded gasoline; 2/4,000-gallon diesel","Yes","Yes","RI",82,"2014-12-12","11-07-09-1244-13",null,"Mixed Media","VO",null,null,"Remediation  Standards","Ingestion/Dermal",null,null,null,null,null,"Soil and ground water delineation has been completed. Benzene detected above GWQS but below VIGWSL. RAW being prepared.  February 2014 - Benzene detected above drinking water standard in on-site potable well.  March 2014 - POET installed on potable well.  Drinking water monitored and no exceedences were detected.  May 2015 - IEC source control report submitted."]
["Display in New version?","Yes","Yes","No","Yes","Yes","Yes","Yes","No","Yes","Yes","Yes","Yes","Yes","Yes","Yes","Yes","Yes","Yes","Yes","Yes","NO-Remove","Yes","Yes"]
["Column Type","Free Text ","Drop-Down.  ","Vlookup to\nAOC Type, saves Aoc Type code","Free Text","Drop-Down",null,"Drop-Down","Vlookup to\nAOC Status, saves AOC status code","Date","Free Text","Number ","Drop-Down","Drop-Down","Drop-Down","Drop-Down","Drop-Down","Drop-Down","Drop-Down","Drop-Down","Drop-Down","N/A","Drop-Down","Free Text"]
["Changes to DD Values","N/A","Current DD is a list of SI Category Desc || SI Type Desc.  LSRPs want DD to display only Type code, alphabetically with type -ahead. ","N/A","N/A","Add 'No Sampling Trigger'","New Column, Values Yes/No","Possibly adding a status for RAO ISRA Leasehold","N/A","N/A","N/A","N/A","N/A","N/A","N/A","N/A","N/A","N/A","N/A","N/A","N/A","N/A","N/A","N/A"]
["\nValidation 1","Not Empty if col b-i has any values","Not Empty if col\na-i has any values","Determine valid code","Not Empty if col\na-i has any values","Not Empty if col\na-i has any values","Not Empty if col\na-i has any values","Not Empty if col\na-i has any values","Determine valid code","Not Empty if col\na-i has any values","Can be null","Can be null","Can be null","Can be null","Can be null","Can be null","Can be null","Can be null","Can be null","Can be null","Can be null","N/A","Can be null","Not Empty if col\na-i has any values"]
["\nValidation 2","< 100 char","Valid Values",null,"< 500 char","Valid values","Valid values","Valid values",null,"Date in past","If Present, validate for allowed incident formats, seperated by a comma, (same as upload validation).  Make sure to check for leading and trailing spaces","> 1000000","Not null if Confirmed Contamination = Y","Not null if Confirmed Contamination = Y",null,null,"Not null if Confirmed Contamination = Y","Not null if Confirmed Contamination = Y",null,"Not null if Confirmed Contamination = Y AND (AOC Staus in ( RA, any RAO Type) )",null,null,"Not null if Confirmed Contamination = Y","< 4000 (or Warn), ee have to decide, CGI will only import 4000, BIR says if > 4000 it's too much"]
["\nValidation 3","No Duplicates in Col A","Check for AOC Description text for 'UST' or 'underground storage tank'  if AOC Type is not in (State or Federal Regulated underground storage tank OR Unregulated underground storage tank) WARN user they may have wrong AOC Type"]
["validation 4",null,"Check for AOC Description text for 'AST' or 'Aboveground storage tank'  if AOC Type is not in (Above ground storage tank) WARN user they may have wrong AOC Type"]

{"sheet":"Sample AOC Tracking","index":4,"n_rows":9,"n_cols":20,"rows_kept":9,"cut":false,"hidden":false,"merged":[]}
["Case Name:","Doe's Fuel Stop LLC"]
["PI #:","018467"]
["Activity #:","LSR120001"]
["Case Inventory Document   Version  1.4   02/23/17"]
["AOC ID","AOC Type "," AOC Description","Confirmed Contamination","Exclude AOC from Billing","AOC Status Achieved","Status Achieved Date","Incident Communication Center #s Managed in Case","NJDEP ID","Contaminated Media","Contaminants of Concern ","Additional Contaminants of Concern ","Additional Contaminants of Concern ","Applicable Remediation Standard","Exposure Route","Additional Exposure Route","RA Type","Additional RA Type","Was an Order of Magnitude Evaluation Conducted?","Activity"]
["AOC1","Storage tank and appurtenance - State or Federal Regulated underground storage tank","Current UST Field: 3/10,000-gallon unleaded gasoline; 2/4,000-gallon diesel","Yes","Yes","RI","2014-12-12","11-07-09-1244-13",null,"Mixed Media","VO",null,null,"Remediation  Standards","Ingestion/Dermal",null,null,null,null,"Soil and ground water delineation has been completed. Benzene detected above GWQS but below VIGWSL. RAW being prepared.  February 2014 - Benzene detected above drinking water standard in on-site potable well.  March 2014 - POET installed on potable well.  Drinking water monitored and no exceedences were detected.  May 2015 - IEC source control report submitted."]
["AOC2","Storage tank and appurtenance - Unregulated Under ground storage tank","Former 1/550-gallon #2 heating oil for on-site use","Yes",null,"NFA-A DEP Issued (Unrestricted Use)","1995-04-16","93-04-17-1544-22",null,"Soil","TPHC",null,null,"Soil Cleanup Criteria (RAW approved for AOC prior to 12/2/2008)","Ingestion/Dermal",null,"Excavation",null,"Yes","Soil contamination identified and excated. Post ex-sampling below soil standards. Ground Water was below the GWQS."]
["AOC3","Storage tank and appurtenance - Above ground storage tank","Current 1/1,000-gallon #2 heating oil AST for on-site use","No",null,"PA","2014-03-12",null,null,"None",null,null,null,"Remediation  Standards",null,null,null,null,null,"PA identified AST as potential AOC. No signs of a discharge, no staining around the AST. No further investigation recommended."]
["AOC4","Environmental media - Media Ground water","Chlorinated Contamination from Off-site Source","Yes","Yes","RAO-A (Unrestricted Use)","2015-05-19","14-01-19-1059-16",null,"Ground Water","VO",null,null,"Remediation  Standards","Ground Water",null,null,null,null,"Chlorinated VOC detected in ground water. Jan. 2014 - Department's hotline notified of chlorinated VOC contamination in gw. March 2014 - PA submitted and background investigation done. No onsite sources of chlorinated VOC discovered. Hotlin notified of verified unknown source (12-05-01-1201-52). RAO-A Unrestricted Use issued for verified unkown source of chlorinated VOC in gw."]

{"sheet":"AOC Tracking","index":5,"n_rows":1000,"n_cols":22,"rows_kept":1000,"cut":false,"hidden":true,"merged":[]}
["Case Name:"]
["PI #:"]
["Activity #:"]
["Case Inventory Document   Version  1.5.1   02/04/21"]
["AOC ID","AOC Type ","AOC Code"," AOC Description","Confirmed Contamination","AOC Status","AOC Status Code","Status Date","Incident #","DEP AOC Number","Contaminated Media","Contaminants of Concern ","Additional Contaminants of Concern ","Additional Contaminants of Concern ","Applicable Remediation Standard","Exposure Route","Additional\nExposure Route","RA Type","Additional\nRA Type","Was an Order of Magnitude Evaluation Conducted?","Activity","AOC in Billing"]
[null,null,{"$f":"VLOOKUP(B6,Dropdowns!$A$2:$B$49,2,FALSE)","v":{"$error":"#N/A"}},null,null,null,{"$f":"VLOOKUP(F6,Dropdowns!$D$2:$E$31,2,FALSE)","v":{"$error":"#N/A"}}]
[null,null,{"$f":"VLOOKUP(B7,Dropdowns!$A$2:$B$49,2,FALSE)","v":{"$error":"#N/A"}},null,null,null,{"$f":"VLOOKUP(F7,Dropdowns!$D$2:$E$31,2,FALSE)","v":{"$error":"#N/A"}}]
[null,null,{"$f":"VLOOKUP(B8,Dropdowns!$A$2:$B$49,2,FALSE)","v":{"$error":"#N/A"}},null,null,null,{"$f":"VLOOKUP(F8,Dropdowns!$D$2:$E$31,2,FALSE)","v":{"$error":"#N/A"}}]
[null,null,{"$f":"VLOOKUP(B9,Dropdowns!$A$2:$B$49,2,FALSE)","v":{"$error":"#N/A"}},null,null,null,{"$f":"VLOOKUP(F9,Dropdowns!$D$2:$E$31,2,FALSE)","v":{"$error":"#N/A"}}]
[null,null,{"$f":"VLOOKUP(B10,Dropdowns!$A$2:$B$49,2,FALSE)","v":{"$error":"#N/A"}},null,null,null,{"$f":"VLOOKUP(F10,Dropdowns!$D$2:$E$31,2,FALSE)","v":{"$error":"#N/A"}}]
[null,null,{"$f":"VLOOKUP(B11,Dropdowns!$A$2:$B$49,2,FALSE)","v":{"$error":"#N/A"}},null,null,null,{"$f":"VLOOKUP(F11,Dropdowns!$D$2:$E$31,2,FALSE)","v":{"$error":"#N/A"}}]
[null,null,{"$f":"VLOOKUP(B12,Dropdowns!$A$2:$B$49,2,FALSE)","v":{"$error":"#N/A"}},null,null,null,{"$f":"VLOOKUP(F12,Dropdowns!$D$2:$E$31,2,FALSE)","v":{"$error":"#N/A"}}]
[null,null,{"$f":"VLOOKUP(B13,Dropdowns!$A$2:$B$49,2,FALSE)","v":{"$error":"#N/A"}},null,null,null,{"$f":"VLOOKUP(F13,Dropdowns!$D$2:$E$31,2,FALSE)","v":{"$error":"#N/A"}}]
[null,null,{"$f":"VLOOKUP(B14,Dropdowns!$A$2:$B$49,2,FALSE)","v":{"$error":"#N/A"}},null,null,null,{"$f":"VLOOKUP(F14,Dropdowns!$D$2:$E$31,2,FALSE)","v":{"$error":"#N/A"}}]
[null,null,{"$f":"VLOOKUP(B15,Dropdowns!$A$2:$B$49,2,FALSE)","v":{"$error":"#N/A"}},null,null,null,{"$f":"VLOOKUP(F15,Dropdowns!$D$2:$E$31,2,FALSE)","v":{"$error":"#N/A"}}]
[null,null,{"$f":"VLOOKUP(B16,Dropdowns!$A$2:$B$49,2,FALSE)","v":{"$error":"#N/A"}},null,null,null,{"$f":"VLOOKUP(F16,Dropdowns!$D$2:$E$31,2,FALSE)","v":{"$error":"#N/A"}}]
[null,null,{"$f":"VLOOKUP(B17,Dropdowns!$A$2:$B$49,2,FALSE)","v":{"$error":"#N/A"}},null,null,null,{"$f":"VLOOKUP(F17,Dropdowns!$D$2:$E$31,2,FALSE)","v":{"$error":"#N/A"}}]
[null,null,{"$f":"VLOOKUP(B18,Dropdowns!$A$2:$B$49,2,FALSE)","v":{"$error":"#N/A"}},null,null,null,{"$f":"VLOOKUP(F18,Dropdowns!$D$2:$E$31,2,FALSE)","v":{"$error":"#N/A"}}]
[null,null,{"$f":"VLOOKUP(B19,Dropdowns!$A$2:$B$49,2,FALSE)","v":{"$error":"#N/A"}},null,null,null,{"$f":"VLOOKUP(F19,Dropdowns!$D$2:$E$31,2,FALSE)","v":{"$error":"#N/A"}}]
[null,null,{"$f":"VLOOKUP(B20,Dropdowns!$A$2:$B$49,2,FALSE)","v":{"$error":"#N/A"}},null,null,null,{"$f":"VLOOKUP(F20,Dropdowns!$D$2:$E$31,2,FALSE)","v":{"$error":"#N/A"}}]
[null,null,{"$f":"VLOOKUP(B21,Dropdowns!$A$2:$B$49,2,FALSE)","v":{"$error":"#N/A"}},null,null,null,{"$f":"VLOOKUP(F21,Dropdowns!$D$2:$E$31,2,FALSE)","v":{"$error":"#N/A"}}]
[null,null,{"$f":"VLOOKUP(B22,Dropdowns!$A$2:$B$49,2,FALSE)","v":{"$error":"#N/A"}},null,null,null,{"$f":"VLOOKUP(F22,Dropdowns!$D$2:$E$31,2,FALSE)","v":{"$error":"#N/A"}}]
[null,null,{"$f":"VLOOKUP(B23,Dropdowns!$A$2:$B$49,2,FALSE)","v":{"$error":"#N/A"}},null,null,null,{"$f":"VLOOKUP(F23,Dropdowns!$D$2:$E$31,2,FALSE)","v":{"$error":"#N/A"}}]
[null,null,{"$f":"VLOOKUP(B24,Dropdowns!$A$2:$B$49,2,FALSE)","v":{"$error":"#N/A"}},null,null,null,{"$f":"VLOOKUP(F24,Dropdowns!$D$2:$E$31,2,FALSE)","v":{"$error":"#N/A"}}]
[null,null,{"$f":"VLOOKUP(B25,Dropdowns!$A$2:$B$49,2,FALSE)","v":{"$error":"#N/A"}},null,null,null,{"$f":"VLOOKUP(F25,Dropdowns!$D$2:$E$31,2,FALSE)","v":{"$error":"#N/A"}}]
[null,null,{"$f":"VLOOKUP(B26,Dropdowns!$A$2:$B$49,2,FALSE)","v":{"$error":"#N/A"}},null,null,null,{"$f":"VLOOKUP(F26,Dropdowns!$D$2:$E$31,2,FALSE)","v":{"$error":"#N/A"}}]
[null,null,{"$f":"VLOOKUP(B27,Dropdowns!$A$2:$B$49,2,FALSE)","v":{"$error":"#N/A"}},null,null,null,{"$f":"VLOOKUP(F27,Dropdowns!$D$2:$E$31,2,FALSE)","v":{"$error":"#N/A"}}]
[null,null,{"$f":"VLOOKUP(B28,Dropdowns!$A$2:$B$49,2,FALSE)","v":{"$error":"#N/A"}},null,null,null,{"$f":"VLOOKUP(F28,Dropdowns!$D$2:$E$31,2,FALSE)","v":{"$error":"#N/A"}}]
[null,null,{"$f":"VLOOKUP(B29,Dropdowns!$A$2:$B$49,2,FALSE)","v":{"$error":"#N/A"}},null,null,null,{"$f":"VLOOKUP(F29,Dropdowns!$D$2:$E$31,2,FALSE)","v":{"$error":"#N/A"}}]
[null,null,{"$f":"VLOOKUP(B30,Dropdowns!$A$2:$B$49,2,FALSE)","v":{"$error":"#N/A"}},null,null,null,{"$f":"VLOOKUP(F30,Dropdowns!$D$2:$E$31,2,FALSE)","v":{"$error":"#N/A"}}]
{"$rows_left_out":971}
{"sheet":"Dropdowns","index":6,"n_rows":58,"n_cols":14,"rows_kept":58,"cut":false,"hidden":true,"merged":[]}
["AOC Description","AOC_Code","Contaminated","AOC Status","Status Code","Contaminated Media","Contents","Contaminants Above Applicable Remediation Standards","Applicable Remediation Standards","RA Type","Exposure Route","Yes or No","Exclude from Billing","Order of Magnitude"]
["Storage tank and appurtenance - Above ground storage tank","ASAG","Yes","PA",79,"Soil",null,"VO","AOC Specific ARS","Absorbent materials","Ground Water","Yes","Yes","N/A"]
["Storage tank and appurtenance - State or Federal Regulated underground storage tank","ASUF","No","SI",80,"Ground Water",null,"BN","AOC Specific ARS and Remediation Standards","Aerated floor system","Ground Water & Surface Water","No",null,"Yes"]
["Storage tank and appurtenance - Unregulated underground storage tank","ASUU","Undetermined","PA/SI",81,"Surface Water",null,"Metals","Remediation  Standards","Air Sparging","Inhalation",null,null,"No"]
["Storage tank and appurtenance - Silo","ASSI","No Sampling Trigger","RI",82,"Mixed Media",null,"Pesticides","Soil Cleanup Criteria (see instructions for appropriate use)","Air sparging/soil vapor extraction (AS/SVE)","Ingestion/Dermal"]
["Storage tank and appurtenance - Rail car","ASRC",null,"RAW",83,"Sediment",null,"PCBs",null,"Attainment","Overland Flow"]
["Storage tank and appurtenance - Piping, above/below ground pump station, sump/pit","ASPS",null,"RA",84,"Indoor Air",null,"PAHs",null,"Bank Stabilization","Overland Flow & Surface Water"]
["Storage tank and appurtenance - Loading and unloading area","ASLU",null,"RIP Waiver",86,null,null,"EPH",null,"Bioremediation","Sediment"]
["Storage and staging area - Storage pad and area","ATSP",null,"UST Waiver",87,null,null,"EPH + PAHs",null,"Bioslurping/enhanced fluid recovery (EFR)","Sediment & Surface Water"]
["Storage and staging area - Surface impoundment and lagoon","ATSL",null,"RAO-AOC (Unrestricted Use)",61,null,null,"EPH + BN",null,"Block wall depressurization system","Surface Water"]
["Storage and staging area - Dumpster","ATSD",null,"RAO-AOC (Limited Restricted Use)",63,null,null,"TPHC",null,"Capping"]
["Storage and staging area - Chemical storage cabinet or closet","ATSC",null,"RAO-AOC (Restricted Use)",62,null,null,"Dioxin",null,"Capping of Sediments"]
["Discharge and disposal area - Area of discharge pursuant to N.J.A.C. 7:1E","AA71",null,"RAO-Child Care Facility (Unrestricted Use).","AB",null,null,"VO + BN",null,"Chemical Injection"]
["Discharge and disposal area - Historic fill material area/other fill area","AAHF",null,"RAO-Child Care Facility (Limited Restricted Use)","AC",null,null,"VO+ Metals",null,"Chemical Oxidation"]
["Discharge and disposal area - Incinerator","AAIN",null,"RAO-Child Care Facility (Restricted Use)","AD",null,null,"VO + Pesticides",null,"Chemical Reduction"]
["Discharge and disposal area - Landfarm","AALR",null,"RAO-Entire Site (Unrestricted Use)",58,null,null,"VO + PCBs",null,"Containment"]
["Discharge and disposal area - Landfill","AALF",null,"RAO-Entire Site  (Limited Restricted Use)",60,null,null,"VO + PAHs",null,"Cosolvent flushing"]
["Discharge and disposal area - Sprayfield","AASF",null,"RAO-Entire Site (Restricted Use)",59,null,null,"VO + EPH",null,"Drain tile depressurization system"]
["Discharge and disposal area - Waste pile as defined by N.J.A.C. 7:26","AA72",null,"RAO-ISRA Entire Site (Unrestricted Use)","AH",null,null,"BN + Metals",null,"Dual phase extraction"]
["Discharge and disposal area - Waste water treatment systems/septic/seepage pit/dry well","AAWW",null,"RAO-ISRA Entire Site (Limited Restricted Use)","AI",null,null,"BN + Pesticides",null,"Dual-pump liquid extraction (DPLE)"]
["Drainage system and area - Building floor drain and piping","ADSF",null,"RAO-ISRA Entire Site (Restricted Use)","AJ",null,null,"BN + PCBs",null,"Ecological Risk Assessment"]
["Drainage system and area - Building sump and pit","ADSP",null,"RAO-ISRA Leasehold (Unrestricted Use)","AE",null,null,"BN + PAHs",null,"Excavation"]
["Drainage system and area - Building trench/piping from sink-rec'd process waste","ADBT",null,"RAO-ISRA Leasehold (Limited Restricted Use)","AF",null,null,"Metals + Pesticides",null,"Heat recovery ventilator"]
["Drainage system and area - Drainage swale and culvert","ADDS",null,"RAO-ISRA Leasehold (Restricted Use)","AG",null,null,"Metals + PCBs",null,"Hot spot removal"]
["Drainage system and area - Dry well and sump","ADDW",null,"NFA-AOC DEP Issued (Unrestricted Use)",36,null,null,"Metals + PAHs",null,"In situ chemical oxidation (ISCO)"]
["Drainage system and area - Leach field","ADLF",null,"NFA-AOC DEP Issued (Limited Restricted Use)",37,null,null,"Metals + EPH",null,"In situ soil mixing (stabilization)"]
["Drainage system and area - Roof leader (process operations vent to roof)","ADRL",null,"NFA-AOC DEP Issued (Restricted Use)",38,null,null,"Pesticides + PCBs",null,"Injection of surfactants"]
["Drainage system and area - Storm sewer collection system","ADSS",null,"NFA-Entire Site DEP Issued (Unrestricted Use)",39,null,null,"Pesticides + PAHs",null,"In-situ-injection"]
["Drainage system and area - Storm water detention pond and fire pond","ADST",null,"NFA-Entire Site DEP Issued (Limited Restricted Use)",40,null,null,"Pesticides + EPH",null,"Institutional Control"]
["Drainage system and area - Surface water body","ADSW",null,"NFA-Entire Site DEP Issued (Restricted Use)",41,null,null,"Other",null,"LNAPL skimming"]
{"$rows_left_out":29}
{"sheet":"For CGI-migration help","index":7,"n_rows":3,"n_cols":22,"rows_kept":3,"cut":false,"hidden":true,"merged":[]}
[]
["AOC ID","AOC Type","AOC Code","Additional AOC Details as needed (eg, size of UST, AGST, location of floor drain if multiples exist)","Contaminated","AOC Status","AOC Status Code","Status Date","Incident # (or NA)","DEP AOC Number","Contaminated Media","Contaminants of Concern","Additional Contaminants Above Applicable Remediation Standards","Additional Contaminants Above Applicable Remediation Standards","Applicable Remediation Standard","Exposure Route","Exposure Route","RA Type","RA Type","RA Type","Was an Order of Magnitude Evaluation Conducted?","Activity"]
["Migrates to SI designation","SI Type desc, will save si type code in background","Code populates from AOC Type Choice.  Migrates to subject_item,si_type_code","Migrates to SI desc ","Dropdown:  Y,N, undetermined (migrates to  Confirmed Contamination field at AOC SI","dropdown-saves code in background, ","Code populates from AOC Status Choice, migrates to subj_item_srp_case_status_hist and subject_item.status_code","date value subject_item.status_date","string of delimited com center numbers free entered see specs for migration","SI ID-used optionally for matching","choose from dropdown","choose from dropdown","choose from dropdown","choose from dropdown","choose from dropdown","choose from dropdown","choose from dropdown","choose from dropdown","choose from dropdown","choose from dropdown","Yes/No/NA"]

{"sheet":"CID Validations","index":8,"n_rows":24,"n_cols":2,"rows_kept":24,"cut":false,"hidden":true,"merged":[]}
[null,"CID Validation Tests"]
[]
[null,"When the CID is uploaded to NJDEP, the Online Service performs 13 validation tests. The tests are listed below by the error messages they produce."]
[]
[null,"1.       Duplicate AOC ID"]
[null,"2.       AOC ID is Required "]
[null,"3.       AOC ID > 100 Characters"]
[null,"4.       AOC Type is Required"]
[null,"5.       AOC Description/Details > 500 Characters"]
[null,"6.       AOC Description is Required"]
[null,"7.       AOC Status is Required"]
[null,"8.       AOC Status Code is Required"]
[null,"9.       Invalid NJDEP ID# - Is not numeric"]
[null,"10.   Invalid NJDEP ID# - Is not found in the case"]
[null,"11.   Invalid status Date – Invalid or NULL()"]
[null,"12.   Confirmed Contamination is Required"]
[null,"13.   Tank related CIDs must have Registered tanks"]
[]
[null,"Note: Submissions with CIDs that contain more than 90 AOCs will not be successful."]
[]
[null,"This version of the CID can now handle "]
[null,"1.       Special Characters"]
[null,"2.       Ampersands and apostrophes"]
[null,"3.       A with Hat (Ā)"]